Untitled

mail@pastecode.io avatar
unknown
plain_text
2 years ago
1.1 kB
4
Indexable
Never
⠋  Building for production...

 ERROR  Failed to compile with 1 error                                                                                                                                                                                             1:29:03 PM

 error  in ./src/App.vue

Module Error (from ./node_modules/eslint-loader/index.js):

/home/ezpug/client/src/App.vue
  74:7  error  Unexpected console statement  no-console
  75:7  error  Unexpected console statement  no-console

✖ 2 problems (2 errors, 0 warnings)


 @ ./src/main.js 234:0-28 260:13-16
 @ multi ./src/main.js

 ERROR  Build failed with errors.
npm ERR! code ELIFECYCLE
npm ERR! errno 1
npm ERR! ezpug-client@1.0.0 build: `npm run generate-build-version && vue-cli-service build`
npm ERR! Exit status 1
npm ERR!
npm ERR! Failed at the ezpug-client@1.0.0 build script.
npm ERR! This is probably not a problem with npm. There is likely additional logging output above.

npm ERR! A complete log of this run can be found in:
npm ERR!     /root/.npm/_logs/2021-11-12T12_29_03_251Z-debug.log
root@ps-server2045-cjv:/home/ezpug/client#