Untitled

mail@pastecode.io avatar
unknown
plain_text
2 months ago
2.5 kB
1
Indexable
Never
TASK [Project / Build containers] **********************************************
fatal: [energy_test]: FAILED! => {"changed": true, "cmd": "make application-build", "delta": "0:00:05.880430", "end": "2024-03-01 07:21:16.236109", "msg": "non-zero return code", "rc": 2, "start": "2024-03-01 07:21:10.355679", "stderr": "Building frontend\nService 'frontend' failed to build: failed to export image: failed to set parent sha256:433a194c971b89c2b0a4d73ad509d4578c73078bca034eb92e6d268d294983cc: unknown parent image ID sha256:433a194c971b89c2b0a4d73ad509d4578c73078bca034eb92e6d268d294983cc\nmake: *** [Makefile:35: application-build] Error 1", "stderr_lines": ["Building frontend", "Service 'frontend' failed to build: failed to export image: failed to set parent sha256:433a194c971b89c2b0a4d73ad509d4578c73078bca034eb92e6d268d294983cc: unknown parent image ID sha256:433a194c971b89c2b0a4d73ad509d4578c73078bca034eb92e6d268d294983cc", "make: *** [Makefile:35: application-build] Error 1"], "stdout": "Step 1/12 : FROM node:18.12.1 as base\n18.12.1: Pulling from library/node\nDigest: sha256:e9ad817b0d42b4d177a4bef8a0aff97c352468a008c3fdb2b4a82533425480df\nStatus: Downloaded newer image for node:18.12.1\n ---> 7b2a09676e2c\nStep 2/12 : WORKDIR /src\n ---> Using cache\n ---> 837adee181b8\nStep 3/12 : COPY ./src/package.json /src/package.json\n ---> Using cache\n ---> a531958b067e\nStep 4/12 : COPY ./src/packages /src/packages\n ---> Using cache\n ---> 588265eeb844\nStep 5/12 : COPY ./src/src/submodules/shared /src/src/submodules/shared\n ---> Using cache\n ---> 5936de29644c\nStep 6/12 : RUN yarn install -W\n ---> Using cache\n ---> 433a194c971b\n\nStep 7/12 : from base as stage0\n ---> 433a194c971b\nStep 8/12 : COPY ./src /src", "stdout_lines": ["Step 1/12 : FROM node:18.12.1 as base", "18.12.1: Pulling from library/node", "Digest: sha256:e9ad817b0d42b4d177a4bef8a0aff97c352468a008c3fdb2b4a82533425480df", "Status: Downloaded newer image for node:18.12.1", " ---> 7b2a09676e2c", "Step 2/12 : WORKDIR /src", " ---> Using cache", " ---> 837adee181b8", "Step 3/12 : COPY ./src/package.json /src/package.json", " ---> Using cache", " ---> a531958b067e", "Step 4/12 : COPY ./src/packages /src/packages", " ---> Using cache", " ---> 588265eeb844", "Step 5/12 : COPY ./src/src/submodules/shared /src/src/submodules/shared", " ---> Using cache", " ---> 5936de29644c", "Step 6/12 : RUN yarn install -W", " ---> Using cache", " ---> 433a194c971b", "", "Step 7/12 : from base as stage0", " ---> 433a194c971b", "Step 8/12 : COPY ./src /src"]}
Leave a Comment