Untitled

mail@pastecode.io avatar
unknown
plain_text
3 years ago
620 B
2
Indexable
Never
Build started...
1>------ Build started: Project: Cactus.Math, Configuration: Release x64 ------
1>LINK : fatal error C1047: The object or library file '..\..\..\..\external\charls\bin\x64\release\charls64.lib' was created by a different version of the compiler than other objects like 'C:\src\Root\internal\Products\FLIRSense\\obj\x64\Release\Cactus.Math\ATFFFImage.obj'; rebuild all objects and libraries with the same compiler
1>LINK : fatal error LNK1257: code generation failed
1>Done building project "Cactus.Math.vcxproj" -- FAILED.
========== Build: 0 succeeded, 1 failed, 1 up-to-date, 0 skipped ==========