Untitled

mail@pastecode.io avatar
unknown
plain_text
2 years ago
22 kB
3
Indexable
Never
ERROR: ''router-outlet' is not a known element:
1. If 'router-outlet' is an Angular component, then verify that it is part of this module.
2. If 'router-outlet' is a Web Component then add 'CUSTOM_ELEMENTS_SCHEMA' to the '@NgModule.schemas' of this component to suppress this message.'
Chrome 100.0.4896.75 (Windows 10): Executed 144 of 575 SUCCESS (0 secs / 2.696 secs)
ERROR: ''router-outlet' is not a known element:
1. If 'router-outlet' is an Angular component, then verify that it is part of this module.
LOG: Object{payload: 'test2', id: 1, taskType: Object{description: 'test'}, name: 'test2', description: 'test2', status: Object{description: 'test'}, priority: Object{description: 'test'}, createdDate: 'test2', taskUsers: [], execut
ionDate: 'test2', completionDate: 'test2', closeDate: 'test2', executors: 'test2', progress: 'test2', parentId: 1}, '       task'
Chrome 100.0.4896.75 (Windows 10): Executed 272 of 575 SUCCESS (0 secs / 4.301 secs)
LOG: Object{payload: 'test2', id: 1, taskType: Object{description: 'test'}, name: 'test2', description: 'test2', status: Object{description: 'test'}, priority: Object{description: 'test'}, createdDate: 'test2', taskUsers: [], execut
Chrome 100.0.4896.75 (Windows 10) InsiderMenuComponent should create FAILED
        NullInjectorError: R3InjectorError(DynamicTestModule)[ActivatedRoute -> ActivatedRoute]:
          NullInjectorError: No provider for ActivatedRoute!
        error properties: Object({ ngTempTokenPath: null, ngTokenPath: [ 'ActivatedRoute', 'ActivatedRoute' ] })
        NullInjectorError: R3InjectorError(DynamicTestModule)[ActivatedRoute -> ActivatedRoute]:
          NullInjectorError: No provider for ActivatedRoute!
            at NullInjector.get (http://localhost:9876/_karma_webpack_/node_modules/@angular/core/__ivy_ngcc__/fesm2015/core.js:1013:1)
            at R3Injector.get (http://localhost:9876/_karma_webpack_/node_modules/@angular/core/__ivy_ngcc__/fesm2015/core.js:11130:1)
            at R3Injector.get (http://localhost:9876/_karma_webpack_/node_modules/@angular/core/__ivy_ngcc__/fesm2015/core.js:11130:1)
            at NgModuleRef$1.get (http://localhost:9876/_karma_webpack_/node_modules/@angular/core/__ivy_ngcc__/fesm2015/core.js:24252:1)
            at Object.get (http://localhost:9876/_karma_webpack_/node_modules/@angular/core/__ivy_ngcc__/fesm2015/core.js:23956:1)
            at getOrCreateInjectable (http://localhost:9876/_karma_webpack_/node_modules/@angular/core/__ivy_ngcc__/fesm2015/core.js:4169:1)
            at ɵɵdirectiveInject (http://localhost:9876/_karma_webpack_/node_modules/@angular/core/__ivy_ngcc__/fesm2015/core.js:14660:1)
            at NodeInjectorFactory.InsiderMenuComponent_Factory [as factory] (ng:///InsiderMenuComponent/ɵfac.js:5:48)
            at getNodeInjectable (http://localhost:9876/_karma_webpack_/node_modules/@angular/core/__ivy_ngcc__/fesm2015/core.js:4274:1)
            at instantiateRootComponent (http://localhost:9876/_karma_webpack_/node_modules/@angular/core/__ivy_ngcc__/fesm2015/core.js:7972:1)
        Error: Expected undefined to be truthy.
            at <Jasmine>
            at UserContext.<anonymous> (http://localhost:9876/_karma_webpack_/src/app/modules/insider/corporate/components/insider-menu/insider-menu.component.spec.ts:23:23)
            at ZoneDelegate.invoke (http://localhost:9876/_karma_webpack_/node_modules/zone.js/dist/zone-evergreen.js:364:1)
            at ProxyZoneSpec.push.QpwO.ProxyZoneSpec.onInvoke (http://localhost:9876/_karma_webpack_/node_modules/zone.js/dist/zone-testing.js:292:1)
Chrome 100.0.4896.75 (Windows 10): Executed 374 of 575 (1 FAILED) (0 secs / 6.089 secs)
Chrome 100.0.4896.75 (Windows 10) InsiderMenuComponent should create FAILED
        NullInjectorError: R3InjectorError(DynamicTestModule)[ActivatedRoute -> ActivatedRoute]:
          NullInjectorError: No provider for ActivatedRoute!
        error properties: Object({ ngTempTokenPath: null, ngTokenPath: [ 'ActivatedRoute', 'ActivatedRoute' ] })
        NullInjectorError: R3InjectorError(DynamicTestModule)[ActivatedRoute -> ActivatedRoute]:
          NullInjectorError: No provider for ActivatedRoute!
            at NullInjector.get (http://localhost:9876/_karma_webpack_/node_modules/@angular/core/__ivy_ngcc__/fesm2015/core.js:1013:1)
            at R3Injector.get (http://localhost:9876/_karma_webpack_/node_modules/@angular/core/__ivy_ngcc__/fesm2015/core.js:11130:1)
            at R3Injector.get (http://localhost:9876/_karma_webpack_/node_modules/@angular/core/__ivy_ngcc__/fesm2015/core.js:11130:1)
            at NgModuleRef$1.get (http://localhost:9876/_karma_webpack_/node_modules/@angular/core/__ivy_ngcc__/fesm2015/core.js:24252:1)
            at Object.get (http://localhost:9876/_karma_webpack_/node_modules/@angular/core/__ivy_ngcc__/fesm2015/core.js:23956:1)
            at getOrCreateInjectable (http://localhost:9876/_karma_webpack_/node_modules/@angular/core/__ivy_ngcc__/fesm2015/core.js:4169:1)
            at ɵɵdirectiveInject (http://localhost:9876/_karma_webpack_/node_modules/@angular/core/__ivy_ngcc__/fesm2015/core.js:14660:1)
            at NodeInjectorFactory.InsiderMenuComponent_Factory [as factory] (ng:///InsiderMenuComponent/ɵfac.js:5:48)
            at getNodeInjectable (http://localhost:9876/_karma_webpack_/node_modules/@angular/core/__ivy_ngcc__/fesm2015/core.js:4274:1)
            at instantiateRootComponent (http://localhost:9876/_karma_webpack_/node_modules/@angular/core/__ivy_ngcc__/fesm2015/core.js:7972:1)
        Error: Expected undefined to be truthy.
            at <Jasmine>
            at UserContext.<anonymous> (http://localhost:9876/_karma_webpack_/src/app/modules/insider/corporate/components/insider-menu/insider-menu.component.spec.ts:23:23)
            at ZoneDelegate.invoke (http://localhost:9876/_karma_webpack_/node_modules/zone.js/dist/zone-evergreen.js:364:1)
ERROR: ''app-select' is not a known element:
1. If 'app-select' is an Angular component, then verify that it is part of this module.
2. If 'app-select' is a Web Component then add 'CUSTOM_ELEMENTS_SCHEMA' to the '@NgModule.schemas' of this component to suppress this message.'
Chrome 100.0.4896.75 (Windows 10): Executed 510 of 575 (1 FAILED) (0 secs / 8.146 secs)
ERROR: ''app-select' is not a known element:
1. If 'app-select' is an Angular component, then verify that it is part of this module.
ERROR: ''app-pick-datetime' is not a known element:
1. If 'app-pick-datetime' is an Angular component, then verify that it is part of this module.
2. If 'app-pick-datetime' is a Web Component then add 'CUSTOM_ELEMENTS_SCHEMA' to the '@NgModule.schemas' of this component to suppress this message.'
Chrome 100.0.4896.75 (Windows 10): Executed 510 of 575 (1 FAILED) (0 secs / 8.146 secs)
ERROR: ''app-pick-datetime' is not a known element:
1. If 'app-pick-datetime' is an Angular component, then verify that it is part of this module.
ERROR: ''app-pick-datetime' is not a known element:
1. If 'app-pick-datetime' is an Angular component, then verify that it is part of this module.
2. If 'app-pick-datetime' is a Web Component then add 'CUSTOM_ELEMENTS_SCHEMA' to the '@NgModule.schemas' of this component to suppress this message.'
Chrome 100.0.4896.75 (Windows 10): Executed 510 of 575 (1 FAILED) (0 secs / 8.146 secs)
ERROR: ''app-pick-datetime' is not a known element:
1. If 'app-pick-datetime' is an Angular component, then verify that it is part of this module.
ERROR: ''app-pick-datetime' is not a known element:
1. If 'app-pick-datetime' is an Angular component, then verify that it is part of this module.
2. If 'app-pick-datetime' is a Web Component then add 'CUSTOM_ELEMENTS_SCHEMA' to the '@NgModule.schemas' of this component to suppress this message.'
Chrome 100.0.4896.75 (Windows 10): Executed 510 of 575 (1 FAILED) (0 secs / 8.146 secs)
ERROR: ''app-pick-datetime' is not a known element:
1. If 'app-pick-datetime' is an Angular component, then verify that it is part of this module.
ERROR: ''app-select' is not a known element:
1. If 'app-select' is an Angular component, then verify that it is part of this module.
2. If 'app-select' is a Web Component then add 'CUSTOM_ELEMENTS_SCHEMA' to the '@NgModule.schemas' of this component to suppress this message.'
Chrome 100.0.4896.75 (Windows 10): Executed 510 of 575 (1 FAILED) (0 secs / 8.146 secs)
ERROR: ''app-select' is not a known element:
1. If 'app-select' is an Angular component, then verify that it is part of this module.
ERROR: ''app-button-with-spinner' is not a known element:
1. If 'app-button-with-spinner' is an Angular component, then verify that it is part of this module.
2. If 'app-button-with-spinner' is a Web Component then add 'CUSTOM_ELEMENTS_SCHEMA' to the '@NgModule.schemas' of this component to suppress this message.'
Chrome 100.0.4896.75 (Windows 10): Executed 510 of 575 (1 FAILED) (0 secs / 8.146 secs)
ERROR: ''app-button-with-spinner' is not a known element:
1. If 'app-button-with-spinner' is an Angular component, then verify that it is part of this module.
ERROR: ''app-insider-list' is not a known element:
1. If 'app-insider-list' is an Angular component, then verify that it is part of this module.
2. If 'app-insider-list' is a Web Component then add 'CUSTOM_ELEMENTS_SCHEMA' to the '@NgModule.schemas' of this component to suppress this message.'
Chrome 100.0.4896.75 (Windows 10): Executed 510 of 575 (1 FAILED) (0 secs / 8.146 secs)
ERROR: ''app-insider-list' is not a known element:
1. If 'app-insider-list' is an Angular component, then verify that it is part of this module.
ERROR: 'Can't bind to 'items' since it isn't a known property of 'app-select'.'
Chrome 100.0.4896.75 (Windows 10): Executed 510 of 575 (1 FAILED) (0 secs / 8.146 secs)
ERROR: 'Can't bind to 'items' since it isn't a known property of 'app-select'.'
Chrome 100.0.4896.75 (Windows 10): Executed 510 of 575 (1 FAILED) (0 secs / 8.146 secs)
ERROR: 'Can't bind to 'buttonStyleTypes' since it isn't a known property of 'app-button-with-spinner'.'
Chrome 100.0.4896.75 (Windows 10): Executed 510 of 575 (1 FAILED) (0 secs / 8.146 secs)
ERROR: 'Can't bind to 'showSpinner' since it isn't a known property of 'app-button-with-spinner'.'
Chrome 100.0.4896.75 (Windows 10): Executed 510 of 575 (1 FAILED) (0 secs / 8.146 secs)
ERROR: ''svg-icon' is not a known element:
1. If 'svg-icon' is an Angular component, then verify that it is part of this module.
2. If 'svg-icon' is a Web Component then add 'CUSTOM_ELEMENTS_SCHEMA' to the '@NgModule.schemas' of this component to suppress this message.'
Chrome 100.0.4896.75 (Windows 10): Executed 536 of 575 (1 FAILED) (0 secs / 8.595 secs)
ERROR: ''svg-icon' is not a known element:
1. If 'svg-icon' is an Angular component, then verify that it is part of this module.
ERROR: ''app-paginator' is not a known element:
1. If 'app-paginator' is an Angular component, then verify that it is part of this module.
2. If 'app-paginator' is a Web Component then add 'CUSTOM_ELEMENTS_SCHEMA' to the '@NgModule.schemas' of this component to suppress this message.'
Chrome 100.0.4896.75 (Windows 10): Executed 536 of 575 (1 FAILED) (0 secs / 8.595 secs)
ERROR: ''app-paginator' is not a known element:
1. If 'app-paginator' is an Angular component, then verify that it is part of this module.
ERROR: 'Can't bind to 'svgStyle' since it isn't a known property of 'svg-icon'.'
Chrome 100.0.4896.75 (Windows 10): Executed 536 of 575 (1 FAILED) (0 secs / 8.595 secs)
ERROR: ''svg-icon' is not a known element:
1. If 'svg-icon' is an Angular component, then verify that it is part of this module.
2. If 'svg-icon' is a Web Component then add 'CUSTOM_ELEMENTS_SCHEMA' to the '@NgModule.schemas' of this component to suppress this message.'
Chrome 100.0.4896.75 (Windows 10): Executed 536 of 575 (1 FAILED) (0 secs / 8.595 secs)
ERROR: ''svg-icon' is not a known element:
1. If 'svg-icon' is an Angular component, then verify that it is part of this module.
ERROR: 'Can't bind to 'page' since it isn't a known property of 'app-paginator'.'
Chrome 100.0.4896.75 (Windows 10): Executed 536 of 575 (1 FAILED) (0 secs / 8.595 secs)
ERROR: 'Can't bind to 'perPage' since it isn't a known property of 'app-paginator'.'
Chrome 100.0.4896.75 (Windows 10): Executed 536 of 575 (1 FAILED) (0 secs / 8.595 secs)
ERROR: 'Can't bind to 'totalItems' since it isn't a known property of 'app-paginator'.'
Chrome 100.0.4896.75 (Windows 10): Executed 536 of 575 (1 FAILED) (0 secs / 8.595 secs)
ERROR: 'Can't bind to 'routerLink' since it isn't a known property of 'div'.'
Chrome 100.0.4896.75 (Windows 10): Executed 536 of 575 (1 FAILED) (0 secs / 8.595 secs)
ERROR: 'Can't bind to 'svgStyle' since it isn't a known property of 'svg-icon'.'
Chrome 100.0.4896.75 (Windows 10): Executed 536 of 575 (1 FAILED) (0 secs / 8.595 secs)
ERROR: 'Can't bind to 'routerLink' since it isn't a known property of 'div'.'
Chrome 100.0.4896.75 (Windows 10): Executed 536 of 575 (1 FAILED) (0 secs / 8.595 secs)
ERROR: 'Can't bind to 'svgStyle' since it isn't a known property of 'svg-icon'.'
Chrome 100.0.4896.75 (Windows 10): Executed 536 of 575 (1 FAILED) (0 secs / 8.595 secs)
ERROR: 'Can't bind to 'routerLink' since it isn't a known property of 'div'.'
Chrome 100.0.4896.75 (Windows 10): Executed 536 of 575 (1 FAILED) (0 secs / 8.595 secs)
ERROR: 'Can't bind to 'svgStyle' since it isn't a known property of 'svg-icon'.'
Chrome 100.0.4896.75 (Windows 10): Executed 536 of 575 (1 FAILED) (0 secs / 8.595 secs)
ERROR: 'Can't bind to 'routerLink' since it isn't a known property of 'div'.'
Chrome 100.0.4896.75 (Windows 10): Executed 536 of 575 (1 FAILED) (0 secs / 8.595 secs)
ERROR: 'Can't bind to 'svgStyle' since it isn't a known property of 'svg-icon'.'
Chrome 100.0.4896.75 (Windows 10): Executed 536 of 575 (1 FAILED) (0 secs / 8.595 secs)
ERROR: 'Can't bind to 'routerLink' since it isn't a known property of 'div'.'
Chrome 100.0.4896.75 (Windows 10): Executed 536 of 575 (1 FAILED) (0 secs / 8.595 secs)
ERROR: 'Can't bind to 'svgStyle' since it isn't a known property of 'svg-icon'.'
Chrome 100.0.4896.75 (Windows 10): Executed 536 of 575 (1 FAILED) (0 secs / 8.595 secs)
ERROR: 'Can't bind to 'routerLink' since it isn't a known property of 'div'.'
Chrome 100.0.4896.75 (Windows 10): Executed 536 of 575 (1 FAILED) (0 secs / 8.595 secs)
ERROR: 'Can't bind to 'svgStyle' since it isn't a known property of 'svg-icon'.'
Chrome 100.0.4896.75 (Windows 10): Executed 536 of 575 (1 FAILED) (0 secs / 8.595 secs)
ERROR: 'Can't bind to 'routerLink' since it isn't a known property of 'div'.'
Chrome 100.0.4896.75 (Windows 10): Executed 536 of 575 (1 FAILED) (0 secs / 8.595 secs)
ERROR: 'Can't bind to 'svgStyle' since it isn't a known property of 'svg-icon'.'
Chrome 100.0.4896.75 (Windows 10): Executed 536 of 575 (1 FAILED) (0 secs / 8.595 secs)
ERROR: 'Can't bind to 'routerLink' since it isn't a known property of 'div'.'
Chrome 100.0.4896.75 (Windows 10): Executed 536 of 575 (1 FAILED) (0 secs / 8.595 secs)
ERROR: 'Can't bind to 'svgStyle' since it isn't a known property of 'svg-icon'.'
Chrome 100.0.4896.75 (Windows 10): Executed 536 of 575 (1 FAILED) (0 secs / 8.595 secs)
ERROR: 'Can't bind to 'routerLink' since it isn't a known property of 'div'.'
Chrome 100.0.4896.75 (Windows 10): Executed 536 of 575 (1 FAILED) (0 secs / 8.595 secs)
ERROR: 'Can't bind to 'svgStyle' since it isn't a known property of 'svg-icon'.'
Chrome 100.0.4896.75 (Windows 10): Executed 536 of 575 (1 FAILED) (0 secs / 8.595 secs)
ERROR: 'Can't bind to 'routerLink' since it isn't a known property of 'div'.'
Chrome 100.0.4896.75 (Windows 10): Executed 536 of 575 (1 FAILED) (0 secs / 8.595 secs)
ERROR: 'Can't bind to 'svgStyle' since it isn't a known property of 'svg-icon'.'
Chrome 100.0.4896.75 (Windows 10): Executed 536 of 575 (1 FAILED) (0 secs / 8.595 secs)
ERROR: 'Can't bind to 'routerLink' since it isn't a known property of 'div'.'
Chrome 100.0.4896.75 (Windows 10): Executed 536 of 575 (1 FAILED) (0 secs / 8.595 secs)
ERROR: 'Can't bind to 'svgStyle' since it isn't a known property of 'svg-icon'.'
Chrome 100.0.4896.75 (Windows 10): Executed 536 of 575 (1 FAILED) (0 secs / 8.595 secs)
ERROR: 'Can't bind to 'routerLink' since it isn't a known property of 'div'.'
Chrome 100.0.4896.75 (Windows 10): Executed 536 of 575 (1 FAILED) (0 secs / 8.595 secs)
ERROR: 'Can't bind to 'svgStyle' since it isn't a known property of 'svg-icon'.'
Chrome 100.0.4896.75 (Windows 10): Executed 536 of 575 (1 FAILED) (0 secs / 8.595 secs)
ERROR: 'Can't bind to 'routerLink' since it isn't a known property of 'div'.'
Chrome 100.0.4896.75 (Windows 10): Executed 536 of 575 (1 FAILED) (0 secs / 8.595 secs)
ERROR: 'Can't bind to 'svgStyle' since it isn't a known property of 'svg-icon'.'
Chrome 100.0.4896.75 (Windows 10): Executed 536 of 575 (1 FAILED) (0 secs / 8.595 secs)
Chrome 100.0.4896.75 (Windows 10) InsiderRelatedTableComponent should create FAILED
        NullInjectorError: R3InjectorError(DynamicTestModule)[ActivatedRoute -> ActivatedRoute]:
          NullInjectorError: No provider for ActivatedRoute!
        error properties: Object({ ngTempTokenPath: null, ngTokenPath: [ 'ActivatedRoute', 'ActivatedRoute' ] })
        NullInjectorError: R3InjectorError(DynamicTestModule)[ActivatedRoute -> ActivatedRoute]:
          NullInjectorError: No provider for ActivatedRoute!
            at NullInjector.get (http://localhost:9876/_karma_webpack_/node_modules/@angular/core/__ivy_ngcc__/fesm2015/core.js:1013:1)
            at R3Injector.get (http://localhost:9876/_karma_webpack_/node_modules/@angular/core/__ivy_ngcc__/fesm2015/core.js:11130:1)
            at R3Injector.get (http://localhost:9876/_karma_webpack_/node_modules/@angular/core/__ivy_ngcc__/fesm2015/core.js:11130:1)
            at NgModuleRef$1.get (http://localhost:9876/_karma_webpack_/node_modules/@angular/core/__ivy_ngcc__/fesm2015/core.js:24252:1)
            at Object.get (http://localhost:9876/_karma_webpack_/node_modules/@angular/core/__ivy_ngcc__/fesm2015/core.js:23956:1)
            at getOrCreateInjectable (http://localhost:9876/_karma_webpack_/node_modules/@angular/core/__ivy_ngcc__/fesm2015/core.js:4169:1)
            at ɵɵdirectiveInject (http://localhost:9876/_karma_webpack_/node_modules/@angular/core/__ivy_ngcc__/fesm2015/core.js:14660:1)
            at NodeInjectorFactory.InsiderRelatedTableComponent_Factory [as factory] (ng:///InsiderRelatedTableComponent/ɵfac.js:5:56)
            at getNodeInjectable (http://localhost:9876/_karma_webpack_/node_modules/@angular/core/__ivy_ngcc__/fesm2015/core.js:4274:1)
            at instantiateRootComponent (http://localhost:9876/_karma_webpack_/node_modules/@angular/core/__ivy_ngcc__/fesm2015/core.js:7972:1)
        Error: Expected undefined to be truthy.
            at <Jasmine>
            at UserContext.<anonymous> (http://localhost:9876/_karma_webpack_/src/app/modules/insider/corporate/components/insider-related-table/insider-related-table.component.spec.ts:23:23)
            at ZoneDelegate.invoke (http://localhost:9876/_karma_webpack_/node_modules/zone.js/dist/zone-evergreen.js:364:1)
            at ProxyZoneSpec.push.QpwO.ProxyZoneSpec.onInvoke (http://localhost:9876/_karma_webpack_/node_modules/zone.js/dist/zone-testing.js:292:1)
Chrome 100.0.4896.75 (Windows 10): Executed 558 of 575 (2 FAILED) (0 secs / 8.881 secs)
Chrome 100.0.4896.75 (Windows 10) InsiderRelatedTableComponent should create FAILED
        NullInjectorError: R3InjectorError(DynamicTestModule)[ActivatedRoute -> ActivatedRoute]:
          NullInjectorError: No provider for ActivatedRoute!
        error properties: Object({ ngTempTokenPath: null, ngTokenPath: [ 'ActivatedRoute', 'ActivatedRoute' ] })
        NullInjectorError: R3InjectorError(DynamicTestModule)[ActivatedRoute -> ActivatedRoute]:
          NullInjectorError: No provider for ActivatedRoute!
            at NullInjector.get (http://localhost:9876/_karma_webpack_/node_modules/@angular/core/__ivy_ngcc__/fesm2015/core.js:1013:1)
            at R3Injector.get (http://localhost:9876/_karma_webpack_/node_modules/@angular/core/__ivy_ngcc__/fesm2015/core.js:11130:1)
            at R3Injector.get (http://localhost:9876/_karma_webpack_/node_modules/@angular/core/__ivy_ngcc__/fesm2015/core.js:11130:1)
            at NgModuleRef$1.get (http://localhost:9876/_karma_webpack_/node_modules/@angular/core/__ivy_ngcc__/fesm2015/core.js:24252:1)
            at Object.get (http://localhost:9876/_karma_webpack_/node_modules/@angular/core/__ivy_ngcc__/fesm2015/core.js:23956:1)
            at getOrCreateInjectable (http://localhost:9876/_karma_webpack_/node_modules/@angular/core/__ivy_ngcc__/fesm2015/core.js:4169:1)
            at ɵɵdirectiveInject (http://localhost:9876/_karma_webpack_/node_modules/@angular/core/__ivy_ngcc__/fesm2015/core.js:14660:1)
            at NodeInjectorFactory.InsiderRelatedTableComponent_Factory [as factory] (ng:///InsiderRelatedTableComponent/ɵfac.js:5:56)
            at getNodeInjectable (http://localhost:9876/_karma_webpack_/node_modules/@angular/core/__ivy_ngcc__/fesm2015/core.js:4274:1)
            at instantiateRootComponent (http://localhost:9876/_karma_webpack_/node_modules/@angular/core/__ivy_ngcc__/fesm2015/core.js:7972:1)
        Error: Expected undefined to be truthy.
            at <Jasmine>
            at UserContext.<anonymous> (http://localhost:9876/_karma_webpack_/src/app/modules/insider/corporate/components/insider-related-table/insider-related-table.component.spec.ts:23:23)
            at ZoneDelegate.invoke (http://localhost:9876/_karma_webpack_/node_modules/zone.js/dist/zone-evergreen.js:364:1)
Chrome 100.0.4896.75 (Windows 10): Executed 575 of 575 (2 FAILED) (10.439 secs / 9.073 secs)
TOTAL: 2 FAILED, 573 SUCCESS