Untitled

mail@pastecode.io avatar
unknown
plain_text
a month ago
3.1 kB
4
Indexable
Never
TASK [Project / Collect environment] *******************************************
fatal: [energy_test]: FAILED! => {"changed": true, "cmd": "make application-environment\n", "delta": "0:00:00.091074", "end": "2024-06-14 13:03:57.747167", "msg": "non-zero return code", "rc": 2, "start": "2024-06-14 13:03:57.656093", "stderr": "ls: cannot access '.env.backup.*': No such file or directory\nnode:internal/modules/cjs/loader:1031\n  throw err;\n  ^\n\nError: Cannot find module 'glob'\nRequire stack:\n- /srv/project/ci/collect-environment.js\n    at Function.Module._resolveFilename (node:internal/modules/cjs/loader:1028:15)\n    at Function.Module._load (node:internal/modules/cjs/loader:873:27)\n    at Module.require (node:internal/modules/cjs/loader:1100:19)\n    at require (node:internal/modules/cjs/helpers:119:18)\n    at Object.<anonymous> (/srv/project/ci/collect-environment.js:3:14)\n    at Module._compile (node:internal/modules/cjs/loader:1198:14)\n    at Object.Module._extensions..js (node:internal/modules/cjs/loader:1252:10)\n    at Module.load (node:internal/modules/cjs/loader:1076:32)\n    at Function.Module._load (node:internal/modules/cjs/loader:911:12)\n    at Function.executeUserEntryPoint [as runMain] (node:internal/modules/run_main:81:12) {\n  code: 'MODULE_NOT_FOUND',\n  requireStack: [ '/srv/project/ci/collect-environment.js' ]\n}\nmake[2]: *** [Makefile:5: ci-collect-environment] Error 1\nmake[1]: *** [Makefile:12: ci-collect-environment] Error 2\nmake: *** [Makefile:23: application-environment] Error 2", "stderr_lines": ["ls: cannot access '.env.backup.*': No such file or directory", "node:internal/modules/cjs/loader:1031", "  throw err;", "  ^", "", "Error: Cannot find module 'glob'", "Require stack:", "- /srv/project/ci/collect-environment.js", "    at Function.Module._resolveFilename (node:internal/modules/cjs/loader:1028:15)", "    at Function.Module._load (node:internal/modules/cjs/loader:873:27)", "    at Module.require (node:internal/modules/cjs/loader:1100:19)", "    at require (node:internal/modules/cjs/helpers:119:18)", "    at Object.<anonymous> (/srv/project/ci/collect-environment.js:3:14)", "    at Module._compile (node:internal/modules/cjs/loader:1198:14)", "    at Object.Module._extensions..js (node:internal/modules/cjs/loader:1252:10)", "    at Module.load (node:internal/modules/cjs/loader:1076:32)", "    at Function.Module._load (node:internal/modules/cjs/loader:911:12)", "    at Function.executeUserEntryPoint [as runMain] (node:internal/modules/run_main:81:12) {", "  code: 'MODULE_NOT_FOUND',", "  requireStack: [ '/srv/project/ci/collect-environment.js' ]", "}", "make[2]: *** [Makefile:5: ci-collect-environment] Error 1", "make[1]: *** [Makefile:12: ci-collect-environment] Error 2", "make: *** [Makefile:23: application-environment] Error 2"], "stdout": "", "stdout_lines": []}

PLAY RECAP *********************************************************************
energy_test                : ok=8    changed=0    unreachable=0    failed=1    skipped=0    rescued=0    ignored=0   

make: *** [Makefile:104: deploy-server-update] Ошибка 2
Leave a Comment