asb

mail@pastecode.io avatar
unknown
plain_text
2 years ago
24 kB
2
Indexable
Never
12:25:47  2021-11-16 12:25:47.887 embeddedBinaryValidationUtility[5722:28985502]  DVTProvisioningProfileManager: Failed to load profile "/Users/jenkinsbuild/Library/MobileDevice/Provisioning Profiles/deleted_provision_profiles.txt" (Error Domain=DVTProvisioningProfileSourceErrorDomain Code=0 "No provisioning profile provider found for profile "/Users/jenkinsbuild/Library/MobileDevice/Provisioning Profiles/deleted_provision_profiles.txt"." UserInfo={NSLocalizedDescription=No provisioning profile provider found for profile "/Users/jenkinsbuild/Library/MobileDevice/Provisioning Profiles/deleted_provision_profiles.txt".})
12:25:48  
12:25:48  ValidateEmbeddedBinary /Users/jenkinsbuild/jenkins-dss/workspace/72_bip-meet_sprint6_upgradeBuild/build/ReleaseEnt-iphoneos/jitsi-meet.app/Watch/JitsiMeetCompanion.app (in target 'JitsiMeet' from project 'app')
12:25:48      cd /Users/jenkinsbuild/jenkins-dss/workspace/72_bip-meet_sprint6_upgradeBuild/ios/app
12:25:48      /Applications/Xcode12.0.app/Contents/Developer/usr/bin/embeddedBinaryValidationUtility /Users/jenkinsbuild/jenkins-dss/workspace/72_bip-meet_sprint6_upgradeBuild/build/ReleaseEnt-iphoneos/jitsi-meet.app/Watch/JitsiMeetCompanion.app -signing-cert 571934C617E6AA93AABFC534D5B2EB0A68629D95 -info-plist-path /Users/jenkinsbuild/Library/Developer/Xcode/DerivedData/jitsi-meet-hbqumcnhzlykisdvlutciopijbco/Build/Intermediates.noindex/ArchiveIntermediates/JitsiMeet/InstallationBuildProductsLocation/Applications/jitsi-meet.app/Info.plist
12:25:48  2021-11-16 12:25:47.080 embeddedBinaryValidationUtility[5723:28985489]  DVTProvisioningProfileManager: Failed to load profile "/Users/jenkinsbuild/Library/MobileDevice/Provisioning Profiles/deleted_provision_profiles.txt" (Error Domain=DVTProvisioningProfileSourceErrorDomain Code=0 "No provisioning profile provider found for profile "/Users/jenkinsbuild/Library/MobileDevice/Provisioning Profiles/deleted_provision_profiles.txt"." UserInfo={NSLocalizedDescription=No provisioning profile provider found for profile "/Users/jenkinsbuild/Library/MobileDevice/Provisioning Profiles/deleted_provision_profiles.txt".})
12:25:48  
12:25:48  RegisterExecutionPolicyException /Users/jenkinsbuild/Library/Developer/Xcode/DerivedData/jitsi-meet-hbqumcnhzlykisdvlutciopijbco/Build/Intermediates.noindex/ArchiveIntermediates/JitsiMeet/InstallationBuildProductsLocation/Applications/jitsi-meet.app (in target 'JitsiMeet' from project 'app')
12:25:48      cd /Users/jenkinsbuild/jenkins-dss/workspace/72_bip-meet_sprint6_upgradeBuild/ios/app
12:25:48      builtin-RegisterExecutionPolicyException /Users/jenkinsbuild/Library/Developer/Xcode/DerivedData/jitsi-meet-hbqumcnhzlykisdvlutciopijbco/Build/Intermediates.noindex/ArchiveIntermediates/JitsiMeet/InstallationBuildProductsLocation/Applications/jitsi-meet.app
12:25:48  
12:25:48  Validate /Users/jenkinsbuild/Library/Developer/Xcode/DerivedData/jitsi-meet-hbqumcnhzlykisdvlutciopijbco/Build/Intermediates.noindex/ArchiveIntermediates/JitsiMeet/InstallationBuildProductsLocation/Applications/jitsi-meet.app (in target 'JitsiMeet' from project 'app')
12:25:48      cd /Users/jenkinsbuild/jenkins-dss/workspace/72_bip-meet_sprint6_upgradeBuild/ios/app
12:25:48      builtin-validationUtility /Users/jenkinsbuild/Library/Developer/Xcode/DerivedData/jitsi-meet-hbqumcnhzlykisdvlutciopijbco/Build/Intermediates.noindex/ArchiveIntermediates/JitsiMeet/InstallationBuildProductsLocation/Applications/jitsi-meet.app
12:25:48  
12:25:48  Touch /Users/jenkinsbuild/Library/Developer/Xcode/DerivedData/jitsi-meet-hbqumcnhzlykisdvlutciopijbco/Build/Intermediates.noindex/ArchiveIntermediates/JitsiMeet/InstallationBuildProductsLocation/Applications/jitsi-meet.app (in target 'JitsiMeet' from project 'app')
12:25:48      cd /Users/jenkinsbuild/jenkins-dss/workspace/72_bip-meet_sprint6_upgradeBuild/ios/app
12:25:48      /usr/bin/touch -c /Users/jenkinsbuild/Library/Developer/Xcode/DerivedData/jitsi-meet-hbqumcnhzlykisdvlutciopijbco/Build/Intermediates.noindex/ArchiveIntermediates/JitsiMeet/InstallationBuildProductsLocation/Applications/jitsi-meet.app
12:25:48  
12:25:48  ** ARCHIVE SUCCEEDED **
12:25:48  
12:25:48  Cleaning up previously generated .ipa files
12:25:48  Cleaning up previously generated .dSYM.zip files
12:25:48  Packaging IPA
12:25:48  [ios] $ /bin/sh -c '/usr/libexec/PlistBuddy -c "Print :UUID" /dev/stdin <<< $(/usr/bin/security cms -D -i "/Users/jenkinsbuild/jenkins-dss/workspace/72_bip-meet_sprint6_upgradeBuild/ios/app/profiles/com_bipmeet.mobileprovision")'
12:25:48  Provisioning UUID is replaced with: 3afab3b6-66b9-43bc-b145-b6d080108484
12:25:48  [ios] $ /bin/sh -c '/usr/libexec/PlistBuddy -c "Print :UUID" /dev/stdin <<< $(/usr/bin/security cms -D -i "/Users/jenkinsbuild/jenkins-dss/workspace/72_bip-meet_sprint6_upgradeBuild/ios/app/profiles/com_bipmeet_broadcast_extension.mobileprovision")'
12:25:48  Provisioning UUID is replaced with: b6cc30aa-b28f-40e7-8c4a-14418868f3cd
12:25:48  [ios] $ /bin/sh -c '/usr/libexec/PlistBuddy -c "Print :UUID" /dev/stdin <<< $(/usr/bin/security cms -D -i "/Users/jenkinsbuild/jenkins-dss/workspace/72_bip-meet_sprint6_upgradeBuild/ios/app/profiles/com_bipmeet_watchkit.mobileprovision")'
12:25:48  Provisioning UUID is replaced with: 138af805-51ac-48c7-9547-2560e63ad854
12:25:48  [ios] $ /bin/sh -c '/usr/libexec/PlistBuddy -c "Print :UUID" /dev/stdin <<< $(/usr/bin/security cms -D -i "/Users/jenkinsbuild/jenkins-dss/workspace/72_bip-meet_sprint6_upgradeBuild/ios/app/profiles/com_bipmeet_watchkit_extension.mobileprovision")'
12:25:48  Provisioning UUID is replaced with: bf460f83-2eb3-49c5-a39b-cc6720fcd695
12:25:48  [ios] $ /bin/sh -c '/usr/libexec/PlistBuddy -c "Print :UUID" /dev/stdin <<< $(/usr/bin/security cms -D -i "/Users/jenkinsbuild/jenkins-dss/workspace/72_bip-meet_sprint6_upgradeBuild/ios/app/profiles/com_turkcell_bipmeetent.mobileprovision")'
12:25:48  Provisioning UUID is replaced with: 15f79446-fde9-4e8c-bef4-970afc6c3f65
12:25:48  [ios] $ /bin/sh -c '/usr/libexec/PlistBuddy -c "Print :UUID" /dev/stdin <<< $(/usr/bin/security cms -D -i "/Users/jenkinsbuild/jenkins-dss/workspace/72_bip-meet_sprint6_upgradeBuild/ios/app/profiles/com_turkcell_bipmeetent_broadcast_extension.mobileprovision")'
12:25:48  Provisioning UUID is replaced with: f9a702f1-344d-41ae-96fb-fb8dc3035112
12:25:48  [ios] $ /bin/sh -c '/usr/libexec/PlistBuddy -c "Print :UUID" /dev/stdin <<< $(/usr/bin/security cms -D -i "/Users/jenkinsbuild/jenkins-dss/workspace/72_bip-meet_sprint6_upgradeBuild/ios/app/profiles/com_turkcell_bipmeetent_watchkit.mobileprovision")'
12:25:49  Provisioning UUID is replaced with: c045b6b2-8411-46a6-ae80-90eaa55282d3
12:25:48  [ios] $ /bin/sh -c '/usr/libexec/PlistBuddy -c "Print :UUID" /dev/stdin <<< $(/usr/bin/security cms -D -i "/Users/jenkinsbuild/jenkins-dss/workspace/72_bip-meet_sprint6_upgradeBuild/ios/app/profiles/com_turkcell_bipmeetent_watchkit_extension.mobileprovision")'
12:25:49  Provisioning UUID is replaced with: c5a408ca-a222-42fc-b325-e3382a578d7a
12:25:49  [ios] $ /usr/libexec/PlistBuddy -c "Print :ApplicationProperties:CFBundleVersion" /Users/jenkinsbuild/jenkins-dss/workspace/72_bip-meet_sprint6_upgradeBuild/build/JitsiMeet.xcarchive/Info.plist
12:25:49  [ios] $ /usr/libexec/PlistBuddy -c "Print :ApplicationProperties:CFBundleShortVersionString" /Users/jenkinsbuild/jenkins-dss/workspace/72_bip-meet_sprint6_upgradeBuild/build/JitsiMeet.xcarchive/Info.plist
12:25:49  Packaging JitsiMeet.xcarchive => /Users/jenkinsbuild/jenkins-dss/workspace/72_bip-meet_sprint6_upgradeBuild/build/bip-meet-12-ReleaseEnt.ipa
12:25:49  [ios] $ /usr/bin/xcodebuild -exportArchive -archivePath /Users/jenkinsbuild/jenkins-dss/workspace/72_bip-meet_sprint6_upgradeBuild/build/JitsiMeet.xcarchive -exportPath /Users/jenkinsbuild/jenkins-dss/workspace/72_bip-meet_sprint6_upgradeBuild/build -exportOptionsPlist /Users/jenkinsbuild/jenkins-dss/workspace/72_bip-meet_sprint6_upgradeBuild/build/enterpriseLA4DZFY7SYExportOptions.plist
12:25:49  2021-11-16 12:25:49.795 xcodebuild[5777:28985890] [MT] IDEDistribution: -[IDEDistributionLogging _createLoggingBundleAtPath:]: Created bundle at path '/var/folders/ts/nt6n9ns94nj7pd8042csjkhjb6q8tn/T/JitsiMeet_2021-11-16_12-25-49.794.xcdistributionlogs'.
12:25:49  2021-11-16 12:25:49.808 xcodebuild[5777:28985977]  DVTProvisioningProfileManager: Failed to load profile "/Users/jenkinsbuild/Library/MobileDevice/Provisioning Profiles/deleted_provision_profiles.txt" (Error Domain=DVTProvisioningProfileSourceErrorDomain Code=0 "No provisioning profile provider found for profile "/Users/jenkinsbuild/Library/MobileDevice/Provisioning Profiles/deleted_provision_profiles.txt"." UserInfo={NSLocalizedDescription=No provisioning profile provider found for profile "/Users/jenkinsbuild/Library/MobileDevice/Provisioning Profiles/deleted_provision_profiles.txt".})
12:28:32  error: exportArchive: ipatool failed with an exception: #<CmdSpec::NonZeroExitException: $ /Applications/Xcode12.0.app/Contents/Developer/usr/bin/python3 /Applications/Xcode12.0.app/Contents/Developer/usr/bin/bitcode-build-tool -v -t /Applications/Xcode12.0.app/Contents/Developer/Toolchains/XcodeDefault.xctoolchain/usr/bin --sdk /Applications/Xcode12.0.app/Contents/Developer/Platforms/iPhoneOS.platform/Developer/SDKs/iPhoneOS14.0.sdk -o /var/folders/ts/nt6n9ns94nj7pd8042csjkhjb6q8tn/T/ipatool20211116-5817-f0sqc4/thinned-out/arm64/Payload/jitsi-meet.app/Frameworks/WebRTC.framework/WebRTC --generate-dsym /var/folders/ts/nt6n9ns94nj7pd8042csjkhjb6q8tn/T/ipatool20211116-5817-f0sqc4/thinned-out/arm64/Payload/jitsi-meet.app/Frameworks/WebRTC.framework/WebRTC.dSYM --strip-swift-symbols /var/folders/ts/nt6n9ns94nj7pd8042csjkhjb6q8tn/T/ipatool20211116-5817-f0sqc4/thinned-in/arm64/Payload/jitsi-meet.app/Frameworks/WebRTC.framework/WebRTC
12:28:32  Status: pid 9570 exit 1
12:28:32  Stdout:
12:28:32      SDK path: /Applications/Xcode12.0.app/Contents/Developer/Platforms/iPhoneOS.platform/Developer/SDKs/iPhoneOS14.0.sdk
12:28:32      SDK version: 14.0
12:28:32      PATH: ['/Applications/Xcode12.0.app/Contents/Developer/Toolchains/XcodeDefault.xctoolchain/usr/bin', '/Applications/Xcode12.0.app/Contents/Developer/usr/bin']
12:28:32      Using: /Applications/Xcode12.0.app/Contents/Developer/Toolchains/XcodeDefault.xctoolchain/usr/bin/lipo
12:28:32      MachoInfo: cd /
12:28:32       ['/Applications/Xcode12.0.app/Contents/Developer/Toolchains/XcodeDefault.xctoolchain/usr/bin/lipo', '-info', '/var/folders/ts/nt6n9ns94nj7pd8042csjkhjb6q8tn/T/ipatool20211116-5817-f0sqc4/thinned-in/arm64/Payload/jitsi-meet.app/Frameworks/WebRTC.framework/WebRTC']
12:28:32      -= Output =-
12:28:32      Non-fat file: /var/folders/ts/nt6n9ns94nj7pd8042csjkhjb6q8tn/T/ipatool20211116-5817-f0sqc4/thinned-in/arm64/Payload/jitsi-meet.app/Frameworks/WebRTC.framework/WebRTC is architecture: arm64
12:28:32      Exited with 0
12:28:32      
12:28:32      Command took 0 seconds
12:28:32      Using: /Applications/Xcode12.0.app/Contents/Developer/Toolchains/XcodeDefault.xctoolchain/usr/bin/dwarfdump
12:28:32      GetUUID: cd /
12:28:32       ['/Applications/Xcode12.0.app/Contents/Developer/Toolchains/XcodeDefault.xctoolchain/usr/bin/dwarfdump', '-u', '/var/folders/ts/nt6n9ns94nj7pd8042csjkhjb6q8tn/T/ipatool20211116-5817-f0sqc4/thinned-in/arm64/Payload/jitsi-meet.app/Frameworks/WebRTC.framework/WebRTC']
12:28:32      -= Output =-
12:28:32      UUID: B7E1978B-40AC-3DCA-A0AA-995C1C5B57AA (arm64) /var/folders/ts/nt6n9ns94nj7pd8042csjkhjb6q8tn/T/ipatool20211116-5817-f0sqc4/thinned-in/arm64/Payload/jitsi-meet.app/Frameworks/WebRTC.framework/WebRTC
12:28:32      Exited with 0
12:28:32      
12:28:32      Command took 0 seconds
12:28:32      Using: /Applications/Xcode12.0.app/Contents/Developer/Toolchains/XcodeDefault.xctoolchain/usr/bin/segedit
12:28:32      ExtractXAR: cd /
12:28:32       ['/Applications/Xcode12.0.app/Contents/Developer/Toolchains/XcodeDefault.xctoolchain/usr/bin/segedit', '/var/folders/ts/nt6n9ns94nj7pd8042csjkhjb6q8tn/T/ipatool20211116-5817-f0sqc4/thinned-in/arm64/Payload/jitsi-meet.app/Frameworks/WebRTC.framework/WebRTC', '-extract', '__LLVM', '__bundle', '/var/folders/ts/nt6n9ns94nj7pd8042csjkhjb6q8tn/T/WebRTCj2_1zwzk/WebRTC.arm64.xar']
12:28:32      -= Output =-
12:28:32      Exited with 0
12:28:32      
12:28:32      Command took 2 seconds
12:28:32      Bitcode bundle version: 1.0
12:28:32      Setting platform to: iOS
12:28:32      Using: /Applications/Xcode12.0.app/Contents/Developer/Toolchains/XcodeDefault.xctoolchain/usr/bin/ld
12:28:32      Using: /Applications/Xcode12.0.app/Contents/Developer/Toolchains/XcodeDefault.xctoolchain/usr/bin/clang
12:28:32      Clang option verification failed for bitcode 0001 (unrecognized arguments: -cc1 -fvisibility-inlines-hidden-static-local-var)
12:28:32  
12:28:32  Stderr:
12:28:32  
12:28:32  >
12:28:32      /Applications/Xcode12.0.app/Contents/Developer/usr/bin/ipatool:373:in `run'
12:28:32      /Applications/Xcode12.0.app/Contents/Developer/usr/bin/ipatool:2808:in `block in CompileOrStripBitcodeInBundle'
12:28:32      /Applications/Xcode12.0.app/Contents/Developer/usr/bin/ipatool:2747:in `each'
12:28:32      /Applications/Xcode12.0.app/Contents/Developer/usr/bin/ipatool:2747:in `CompileOrStripBitcodeInBundle'
12:28:32      /Applications/Xcode12.0.app/Contents/Developer/usr/bin/ipatool:3016:in `block in ProcessIPA'
12:28:32      /Applications/Xcode12.0.app/Contents/Developer/usr/bin/ipatool:2978:in `each'
12:28:32      /Applications/Xcode12.0.app/Contents/Developer/usr/bin/ipatool:2978:in `ProcessIPA'
12:28:32      /Applications/Xcode12.0.app/Contents/Developer/usr/bin/ipatool:3928:in `<main>'
12:28:32  
12:28:32  Error Domain=IDEFoundationErrorDomain Code=1 "ipatool failed with an exception: #<CmdSpec::NonZeroExitException: $ /Applications/Xcode12.0.app/Contents/Developer/usr/bin/python3 /Applications/Xcode12.0.app/Contents/Developer/usr/bin/bitcode-build-tool -v -t /Applications/Xcode12.0.app/Contents/Developer/Toolchains/XcodeDefault.xctoolchain/usr/bin --sdk /Applications/Xcode12.0.app/Contents/Developer/Platforms/iPhoneOS.platform/Developer/SDKs/iPhoneOS14.0.sdk -o /var/folders/ts/nt6n9ns94nj7pd8042csjkhjb6q8tn/T/ipatool20211116-5817-f0sqc4/thinned-out/arm64/Payload/jitsi-meet.app/Frameworks/WebRTC.framework/WebRTC --generate-dsym /var/folders/ts/nt6n9ns94nj7pd8042csjkhjb6q8tn/T/ipatool20211116-5817-f0sqc4/thinned-out/arm64/Payload/jitsi-meet.app/Frameworks/WebRTC.framework/WebRTC.dSYM --strip-swift-symbols /var/folders/ts/nt6n9ns94nj7pd8042csjkhjb6q8tn/T/ipatool20211116-5817-f0sqc4/thinned-in/arm64/Payload/jitsi-meet.app/Frameworks/WebRTC.framework/WebRTC
12:28:32  Status: pid 9570 exit 1
12:28:32  Stdout:
12:28:32      SDK path: /Applications/Xcode12.0.app/Contents/Developer/Platforms/iPhoneOS.platform/Developer/SDKs/iPhoneOS14.0.sdk
12:28:32      SDK version: 14.0
12:28:32      PATH: ['/Applications/Xcode12.0.app/Contents/Developer/Toolchains/XcodeDefault.xctoolchain/usr/bin', '/Applications/Xcode12.0.app/Contents/Developer/usr/bin']
12:28:32      Using: /Applications/Xcode12.0.app/Contents/Developer/Toolchains/XcodeDefault.xctoolchain/usr/bin/lipo
12:28:32      MachoInfo: cd /
12:28:32       ['/Applications/Xcode12.0.app/Contents/Developer/Toolchains/XcodeDefault.xctoolchain/usr/bin/lipo', '-info', '/var/folders/ts/nt6n9ns94nj7pd8042csjkhjb6q8tn/T/ipatool20211116-5817-f0sqc4/thinned-in/arm64/Payload/jitsi-meet.app/Frameworks/WebRTC.framework/WebRTC']
12:28:32      -= Output =-
12:28:32      Non-fat file: /var/folders/ts/nt6n9ns94nj7pd8042csjkhjb6q8tn/T/ipatool20211116-5817-f0sqc4/thinned-in/arm64/Payload/jitsi-meet.app/Frameworks/WebRTC.framework/WebRTC is architecture: arm64
12:28:32      Exited with 0
12:28:32      
12:28:32      Command took 0 seconds
12:28:32      Using: /Applications/Xcode12.0.app/Contents/Developer/Toolchains/XcodeDefault.xctoolchain/usr/bin/dwarfdump
12:28:32      GetUUID: cd /
12:28:32       ['/Applications/Xcode12.0.app/Contents/Developer/Toolchains/XcodeDefault.xctoolchain/usr/bin/dwarfdump', '-u', '/var/folders/ts/nt6n9ns94nj7pd8042csjkhjb6q8tn/T/ipatool20211116-5817-f0sqc4/thinned-in/arm64/Payload/jitsi-meet.app/Frameworks/WebRTC.framework/WebRTC']
12:28:32      -= Output =-
12:28:32      UUID: B7E1978B-40AC-3DCA-A0AA-995C1C5B57AA (arm64) /var/folders/ts/nt6n9ns94nj7pd8042csjkhjb6q8tn/T/ipatool20211116-5817-f0sqc4/thinned-in/arm64/Payload/jitsi-meet.app/Frameworks/WebRTC.framework/WebRTC
12:28:32      Exited with 0
12:28:32      
12:28:32      Command took 0 seconds
12:28:32      Using: /Applications/Xcode12.0.app/Contents/Developer/Toolchains/XcodeDefault.xctoolchain/usr/bin/segedit
12:28:32      ExtractXAR: cd /
12:28:32       ['/Applications/Xcode12.0.app/Contents/Developer/Toolchains/XcodeDefault.xctoolchain/usr/bin/segedit', '/var/folders/ts/nt6n9ns94nj7pd8042csjkhjb6q8tn/T/ipatool20211116-5817-f0sqc4/thinned-in/arm64/Payload/jitsi-meet.app/Frameworks/WebRTC.framework/WebRTC', '-extract', '__LLVM', '__bundle', '/var/folders/ts/nt6n9ns94nj7pd8042csjkhjb6q8tn/T/WebRTCj2_1zwzk/WebRTC.arm64.xar']
12:28:32      -= Output =-
12:28:32      Exited with 0
12:28:32      
12:28:32      Command took 2 seconds
12:28:32      Bitcode bundle version: 1.0
12:28:32      Setting platform to: iOS
12:28:32      Using: /Applications/Xcode12.0.app/Contents/Developer/Toolchains/XcodeDefault.xctoolchain/usr/bin/ld
12:28:32      Using: /Applications/Xcode12.0.app/Contents/Developer/Toolchains/XcodeDefault.xctoolchain/usr/bin/clang
12:28:32      Clang option verification failed for bitcode 0001 (unrecognized arguments: -cc1 -fvisibility-inlines-hidden-static-local-var)
12:28:32  
12:28:32  Stderr:
12:28:32  
12:28:32  >
12:28:32      /Applications/Xcode12.0.app/Contents/Developer/usr/bin/ipatool:373:in `run'
12:28:32      /Applications/Xcode12.0.app/Contents/Developer/usr/bin/ipatool:2808:in `block in CompileOrStripBitcodeInBundle'
12:28:32      /Applications/Xcode12.0.app/Contents/Developer/usr/bin/ipatool:2747:in `each'
12:28:32      /Applications/Xcode12.0.app/Contents/Developer/usr/bin/ipatool:2747:in `CompileOrStripBitcodeInBundle'
12:28:32      /Applications/Xcode12.0.app/Contents/Developer/usr/bin/ipatool:3016:in `block in ProcessIPA'
12:28:32      /Applications/Xcode12.0.app/Contents/Developer/usr/bin/ipatool:2978:in `each'
12:28:32      /Applications/Xcode12.0.app/Contents/Developer/usr/bin/ipatool:2978:in `ProcessIPA'
12:28:32      /Applications/Xcode12.0.app/Contents/Developer/usr/bin/ipatool:3928:in `<main>'" UserInfo={NSLocalizedDescription=ipatool failed with an exception: #<CmdSpec::NonZeroExitException: $ /Applications/Xcode12.0.app/Contents/Developer/usr/bin/python3 /Applications/Xcode12.0.app/Contents/Developer/usr/bin/bitcode-build-tool -v -t /Applications/Xcode12.0.app/Contents/Developer/Toolchains/XcodeDefault.xctoolchain/usr/bin --sdk /Applications/Xcode12.0.app/Contents/Developer/Platforms/iPhoneOS.platform/Developer/SDKs/iPhoneOS14.0.sdk -o /var/folders/ts/nt6n9ns94nj7pd8042csjkhjb6q8tn/T/ipatool20211116-5817-f0sqc4/thinned-out/arm64/Payload/jitsi-meet.app/Frameworks/WebRTC.framework/WebRTC --generate-dsym /var/folders/ts/nt6n9ns94nj7pd8042csjkhjb6q8tn/T/ipatool20211116-5817-f0sqc4/thinned-out/arm64/Payload/jitsi-meet.app/Frameworks/WebRTC.framework/WebRTC.dSYM --strip-swift-symbols /var/folders/ts/nt6n9ns94nj7pd8042csjkhjb6q8tn/T/ipatool20211116-5817-f0sqc4/thinned-in/arm64/Payload/jitsi-meet.app/Frameworks/WebRTC.framework/WebRTC
12:28:32  Status: pid 9570 exit 1
12:28:32  Stdout:
12:28:32      SDK path: /Applications/Xcode12.0.app/Contents/Developer/Platforms/iPhoneOS.platform/Developer/SDKs/iPhoneOS14.0.sdk
12:28:32      SDK version: 14.0
12:28:32      PATH: ['/Applications/Xcode12.0.app/Contents/Developer/Toolchains/XcodeDefault.xctoolchain/usr/bin', '/Applications/Xcode12.0.app/Contents/Developer/usr/bin']
12:28:32      Using: /Applications/Xcode12.0.app/Contents/Developer/Toolchains/XcodeDefault.xctoolchain/usr/bin/lipo
12:28:32      MachoInfo: cd /
12:28:32       ['/Applications/Xcode12.0.app/Contents/Developer/Toolchains/XcodeDefault.xctoolchain/usr/bin/lipo', '-info', '/var/folders/ts/nt6n9ns94nj7pd8042csjkhjb6q8tn/T/ipatool20211116-5817-f0sqc4/thinned-in/arm64/Payload/jitsi-meet.app/Frameworks/WebRTC.framework/WebRTC']
12:28:32      -= Output =-
12:28:32      Non-fat file: /var/folders/ts/nt6n9ns94nj7pd8042csjkhjb6q8tn/T/ipatool20211116-5817-f0sqc4/thinned-in/arm64/Payload/jitsi-meet.app/Frameworks/WebRTC.framework/WebRTC is architecture: arm64
12:28:32      Exited with 0
12:28:32      
12:28:32      Command took 0 seconds
12:28:32      Using: /Applications/Xcode12.0.app/Contents/Developer/Toolchains/XcodeDefault.xctoolchain/usr/bin/dwarfdump
12:28:32      GetUUID: cd /
12:28:32       ['/Applications/Xcode12.0.app/Contents/Developer/Toolchains/XcodeDefault.xctoolchain/usr/bin/dwarfdump', '-u', '/var/folders/ts/nt6n9ns94nj7pd8042csjkhjb6q8tn/T/ipatool20211116-5817-f0sqc4/thinned-in/arm64/Payload/jitsi-meet.app/Frameworks/WebRTC.framework/WebRTC']
12:28:32      -= Output =-
12:28:32      UUID: B7E1978B-40AC-3DCA-A0AA-995C1C5B57AA (arm64) /var/folders/ts/nt6n9ns94nj7pd8042csjkhjb6q8tn/T/ipatool20211116-5817-f0sqc4/thinned-in/arm64/Payload/jitsi-meet.app/Frameworks/WebRTC.framework/WebRTC
12:28:32      Exited with 0
12:28:32      
12:28:32      Command took 0 seconds
12:28:32      Using: /Applications/Xcode12.0.app/Contents/Developer/Toolchains/XcodeDefault.xctoolchain/usr/bin/segedit
12:28:32      ExtractXAR: cd /
12:28:32       ['/Applications/Xcode12.0.app/Contents/Developer/Toolchains/XcodeDefault.xctoolchain/usr/bin/segedit', '/var/folders/ts/nt6n9ns94nj7pd8042csjkhjb6q8tn/T/ipatool20211116-5817-f0sqc4/thinned-in/arm64/Payload/jitsi-meet.app/Frameworks/WebRTC.framework/WebRTC', '-extract', '__LLVM', '__bundle', '/var/folders/ts/nt6n9ns94nj7pd8042csjkhjb6q8tn/T/WebRTCj2_1zwzk/WebRTC.arm64.xar']
12:28:32      -= Output =-
12:28:32      Exited with 0
12:28:32      
12:28:32      Command took 2 seconds
12:28:32      Bitcode bundle version: 1.0
12:28:32      Setting platform to: iOS
12:28:32      Using: /Applications/Xcode12.0.app/Contents/Developer/Toolchains/XcodeDefault.xctoolchain/usr/bin/ld
12:28:32      Using: /Applications/Xcode12.0.app/Contents/Developer/Toolchains/XcodeDefault.xctoolchain/usr/bin/clang
12:28:32      Clang option verification failed for bitcode 0001 (unrecognized arguments: -cc1 -fvisibility-inlines-hidden-static-local-var)
12:28:32  
12:28:32  Stderr:
12:28:32  
12:28:32  >
12:28:32      /Applications/Xcode12.0.app/Contents/Developer/usr/bin/ipatool:373:in `run'
12:28:32      /Applications/Xcode12.0.app/Contents/Developer/usr/bin/ipatool:2808:in `block in CompileOrStripBitcodeInBundle'
12:28:32      /Applications/Xcode12.0.app/Contents/Developer/usr/bin/ipatool:2747:in `each'
12:28:32      /Applications/Xcode12.0.app/Contents/Developer/usr/bin/ipatool:2747:in `CompileOrStripBitcodeInBundle'
12:28:32      /Applications/Xcode12.0.app/Contents/Developer/usr/bin/ipatool:3016:in `block in ProcessIPA'
12:28:32      /Applications/Xcode12.0.app/Contents/Developer/usr/bin/ipatool:2978:in `each'
12:28:32      /Applications/Xcode12.0.app/Contents/Developer/usr/bin/ipatool:2978:in `ProcessIPA'
12:28:32      /Applications/Xcode12.0.app/Contents/Developer/usr/bin/ipatool:3928:in `<main>'}
12:28:32  
12:28:32  ** EXPORT FAILED **
12:28:32  
12:28:32  Failed to build /Users/jenkinsbuild/jenkins-dss/workspace/72_bip-meet_sprint6_upgradeBuild/build/bip-meet-12-ReleaseEnt.ipa
[Pipeline] archiveArtifacts
12:28:32  Archiving artifacts
[Pipeline] }
[Pipeline] // stage
[Pipeline] }
[Pipeline] // script
[Pipeline] }
[Pipeline] // withEnv
[Pipeline] }
[Pipeline] // withCredentials
[Pipeline] }
[Pipeline] // node
[Pipeline] }
[Pipeline] // timeout
[Pipeline] }
[Pipeline] // stage
[Pipeline] stage
[Pipeline] { (Approve Deploy to Testflight)
Stage "Approve Deploy to Testflight" skipped due to earlier failure(s)
[Pipeline] }
[Pipeline] // stage
[Pipeline] stage
[Pipeline] { (Deploy to Testflight)
Stage "Deploy to Testflight" skipped due to earlier failure(s)
[Pipeline] }
[Pipeline] // stage
[Pipeline] }
[Pipeline] // timestamps
[Pipeline] End of Pipeline
[Bitbucket] Notifying commit build result
[Bitbucket] Build result notified
ERROR: xcodebuild failed. Check the logs for details
Finished: FAILURE