Untitled
unknown
plain_text
3 years ago
38 kB
3
Indexable
Build started... 1>------ Build started: Project: ZERO_CHECK, Configuration: Debug x64 ------ 1>Build started 13-03-2022 07:49:12 PM. 1>Target PrepareForBuild: 1> Creating directory "x64\Debug\ZERO_CHECK\ZERO_CHECK.tlog\". 1>Target InitializeBuildStatus: 1> Creating "x64\Debug\ZERO_CHECK\ZERO_CHECK.tlog\unsuccessfulbuild" because "AlwaysCreate" was specified. 1>Target CustomBuild: 1> Checking Build System 1>Target FinalizeBuildStatus: 1> Deleting file "x64\Debug\ZERO_CHECK\ZERO_CHECK.tlog\unsuccessfulbuild". 1> Touching "x64\Debug\ZERO_CHECK\ZERO_CHECK.tlog\ZERO_CHECK.lastbuildstate". 1> 1>Build succeeded. 1> 0 Warning(s) 1> 0 Error(s) 1> 1>Time Elapsed 00:00:00.08 2>------ Build started: Project: ge-static, Configuration: Debug x64 ------ 3>------ Build started: Project: ge, Configuration: Debug x64 ------ 4>------ Build started: Project: coreinterface-static, Configuration: Debug x64 ------ 5>------ Build started: Project: coreinterface, Configuration: Debug x64 ------ 2>Build started 13-03-2022 07:49:12 PM. 2>Target ResolveProjectReferences: 3>Build started 13-03-2022 07:49:12 PM. 3>Target ResolveProjectReferences: 3>Target PrepareForBuild: 3> Creating directory "C:\Users\Himanshu\Desktop\Windows\buildRT3\bin\". 3> Creating directory "ge.dir\Debug\ge.tlog\". 4>Build started 13-03-2022 07:49:12 PM. 5>Build started 13-03-2022 07:49:12 PM. 2>Target PrepareForBuild: 2> Creating directory "C:\Users\Himanshu\Desktop\Windows\buildRT3\lib\". 2> Creating directory "ge-static.dir\Debug\ge-static.tlog\". 2>Target InitializeBuildStatus: 2> Creating "ge-static.dir\Debug\ge-static.tlog\unsuccessfulbuild" because "AlwaysCreate" was specified. 2>Target CustomBuild: 2> Building Custom Rule C:/Users/Himanshu/Desktop/Windows/rt-cubed/src/libge/CMakeLists.txt 4>Target ResolveProjectReferences: 4>Target PrepareForBuild: 4> Creating directory "coreinterface-static.dir\Debug\coreinte.5A24540C.tlog\". 4>Target InitializeBuildStatus: 4> Creating "coreinterface-static.dir\Debug\coreinte.5A24540C.tlog\unsuccessfulbuild" because "AlwaysCreate" was specified. 4>Target CustomBuild: 4> Building Custom Rule C:/Users/Himanshu/Desktop/Windows/rt-cubed/src/coreInterface/CMakeLists.txt 3>Target InitializeBuildStatus: 3> Creating "ge.dir\Debug\ge.tlog\unsuccessfulbuild" because "AlwaysCreate" was specified. 3>Target CustomBuild: 3> Building Custom Rule C:/Users/Himanshu/Desktop/Windows/rt-cubed/src/libge/CMakeLists.txt 5>Target ResolveProjectReferences: 5>Target PrepareForBuild: 5> Creating directory "coreinterface.dir\Debug\coreinterface.tlog\". 5>Target InitializeBuildStatus: 5> Creating "coreinterface.dir\Debug\coreinterface.tlog\unsuccessfulbuild" because "AlwaysCreate" was specified. 5>Target CustomBuild: 5> Building Custom Rule C:/Users/Himanshu/Desktop/Windows/rt-cubed/src/coreInterface/CMakeLists.txt 2>Target GetReferencedVCProjectsInfo: 4>Target GetReferencedVCProjectsInfo: 3>Target GetReferencedVCProjectsInfo: 5>Target GetReferencedVCProjectsInfo: 2>Target ClCompile: 2> GeometryEngine.cxx 4>Target ClCompile: 4> Arb8.cpp 3>Target ClCompile: 3> GeometryEngine.cxx 5>Target ClCompile: 5> Arb8.cpp 2> MinimalDatabase.cxx 3> MinimalDatabase.cxx 4> BagOfTriangles.cpp 5> BagOfTriangles.cpp 3> MinimalObject.cxx 2> MinimalObject.cxx 5> Combination.cpp 4> Combination.cpp 2> Arb8.cpp 3> Arb8.cpp 5> Cone.cpp 4> Cone.cpp 3> BagOfTriangles.cpp 2> BagOfTriangles.cpp 5> ConstDatabase.cpp 4> ConstDatabase.cpp 3> Combination.cpp 2> Combination.cpp 4> Database.cpp 5> Database.cpp 2> Cone.cpp 3> Cone.cpp 5> Ellipsoid.cpp 4> Ellipsoid.cpp 2> ConstDatabase.cpp 3> ConstDatabase.cpp 4> EllipticalTorus.cpp 5> EllipticalTorus.cpp 2> Database.cpp 3> Database.cpp 4> FileDatabase.cpp 5> FileDatabase.cpp 3> Ellipsoid.cpp 2> Ellipsoid.cpp 5> globals.cpp 4> globals.cpp 2> EllipticalTorus.cpp 3> EllipticalTorus.cpp 2> FileDatabase.cpp 3> FileDatabase.cpp 5> Halfspace.cpp 4> Halfspace.cpp 2> globals.cpp 3> globals.cpp 5> HyperbolicCylinder.cpp 4> HyperbolicCylinder.cpp 5> Hyperboloid.cpp 4> Hyperboloid.cpp 2> Halfspace.cpp 3> Halfspace.cpp 5> MemoryDatabase.cpp 4> MemoryDatabase.cpp 2> HyperbolicCylinder.cpp 3> HyperbolicCylinder.cpp 5> NonManifoldGeometry.cpp 4> NonManifoldGeometry.cpp 2> Hyperboloid.cpp 3> Hyperboloid.cpp 5> Object.cpp 4> Object.cpp 2> MemoryDatabase.cpp 3> MemoryDatabase.cpp 2> NonManifoldGeometry.cpp 3> NonManifoldGeometry.cpp 5> ParabolicCylinder.cpp 4> ParabolicCylinder.cpp 2> Object.cpp 3> Object.cpp 5> Paraboloid.cpp 4> Paraboloid.cpp 5> Particle.cpp 4> Particle.cpp 2> ParabolicCylinder.cpp 3> ParabolicCylinder.cpp 5> Pipe.cpp 4> Pipe.cpp 3> Generating Code... 2> Generating Code... 3> Compiling... 3> Paraboloid.cpp 2> Compiling... 2> Paraboloid.cpp 5> Generating Code... 4> Generating Code... 5> Compiling... 5> Sketch.cpp 4> Compiling... 4> Sketch.cpp 2> Particle.cpp 3> Particle.cpp 5> Sphere.cpp 2> Pipe.cpp 4> Sphere.cpp 3> Pipe.cpp 2> Sketch.cpp 5> Torus.cpp 4> Torus.cpp 3> Sketch.cpp 2> Sphere.cpp 5> Unknown.cpp 4> Unknown.cpp 5> VectorList.cpp 3> Sphere.cpp 4> VectorList.cpp 2> Torus.cpp 3> Torus.cpp 5> Generating Code... 4> Generating Code... 5>Target Link: 5> Creating library C:/Users/Himanshu/Desktop/Windows/buildRT3/lib/coreinterface.lib and object C:/Users/Himanshu/Desktop/Windows/buildRT3/lib/coreinterface.exp 4>Target Lib: 4> coreinterface-static.vcxproj -> C:\Users\Himanshu\Desktop\Windows\buildRT3\lib\coreinterface-static.lib 4>Target GetCopyToOutputDirectoryItems: 4> Target _GetCopyToOutputDirectoryItemsFromTransitiveProjectReferences: 4>Target FinalizeBuildStatus: 4> Deleting file "coreinterface-static.dir\Debug\coreinte.5A24540C.tlog\unsuccessfulbuild". 4> Touching "coreinterface-static.dir\Debug\coreinte.5A24540C.tlog\coreinterface-static.lastbuildstate". 4> 4>Build succeeded. 4> 0 Warning(s) 4> 0 Error(s) 4> 4>Time Elapsed 00:00:19.54 6>------ Build started: Project: embeddedlua-static, Configuration: Debug x64 ------ 2> Unknown.cpp 6>Build started 13-03-2022 07:49:31 PM. 6>Target ResolveProjectReferences: 6>Target PrepareForBuild: 6> Creating directory "embeddedlua-static.dir\Debug\embedded.758C2004.tlog\". 6>Target InitializeBuildStatus: 6> Creating "embeddedlua-static.dir\Debug\embedded.758C2004.tlog\unsuccessfulbuild" because "AlwaysCreate" was specified. 5> coreinterface.vcxproj -> C:\Users\Himanshu\Desktop\Windows\buildRT3\bin\coreinterface.dll 5>Target GetCopyToOutputDirectoryItems: 5> Target _GetCopyToOutputDirectoryItemsFromTransitiveProjectReferences: 5>Target FinalizeBuildStatus: 5> Deleting file "coreinterface.dir\Debug\coreinterface.tlog\unsuccessfulbuild". 5> Touching "coreinterface.dir\Debug\coreinterface.tlog\coreinterface.lastbuildstate". 5> 5>Build succeeded. 5> 0 Warning(s) 5> 0 Error(s) 5> 5>Time Elapsed 00:00:19.62 7>------ Build started: Project: tester_ci_primitives, Configuration: Debug x64 ------ 8>------ Build started: Project: printTitle, Configuration: Debug x64 ------ 9>------ Build started: Project: embeddedlua, Configuration: Debug x64 ------ 10>------ Build started: Project: QtGUI, Configuration: Debug x64 ------ 2> Generating Code... 6>Target CustomBuild: 6> Building Custom Rule C:/Users/Himanshu/Desktop/Windows/rt-cubed/src/embeddedLua/CMakeLists.txt 6>Target GetReferencedVCProjectsInfo: 9>Build started 13-03-2022 07:49:31 PM. 9>Target ResolveProjectReferences: 9>Target PrepareForBuild: 9> Creating directory "embeddedlua.dir\Debug\embeddedlua.tlog\". 9>Target InitializeBuildStatus: 9> Creating "embeddedlua.dir\Debug\embeddedlua.tlog\unsuccessfulbuild" because "AlwaysCreate" was specified. 8>Build started 13-03-2022 07:49:31 PM. 8>Target ResolveProjectReferences: 8>Target PrepareForBuild: 8> Creating directory "printTitle.dir\Debug\printTitle.tlog\". 8>Target InitializeBuildStatus: 8> Creating "printTitle.dir\Debug\printTitle.tlog\unsuccessfulbuild" because "AlwaysCreate" was specified. 7>Build started 13-03-2022 07:49:31 PM. 7>Target ResolveProjectReferences: 7>Target PrepareForBuild: 7> Creating directory "tester_ci_primitives.dir\Debug\tester_c.F0FDDC2C.tlog\". 7>Target InitializeBuildStatus: 7> Creating "tester_ci_primitives.dir\Debug\tester_c.F0FDDC2C.tlog\unsuccessfulbuild" because "AlwaysCreate" was specified. 10>Build started 13-03-2022 07:49:31 PM. 10>Target ResolveProjectReferences: 10>Target PrepareForBuild: 10> Creating directory "QtGUI.dir\Debug\QtGUI.tlog\". 3> Unknown.cpp 6>Target ClCompile: 6> arb8.cpp 7>Target CustomBuild: 7> Building Custom Rule C:/Users/Himanshu/Desktop/Windows/rt-cubed/tests/coreInterface/CMakeLists.txt 8>Target CustomBuild: 8> Building Custom Rule C:/Users/Himanshu/Desktop/Windows/rt-cubed/tests/coreInterface/CMakeLists.txt 9>Target CustomBuild: 9> Building Custom Rule C:/Users/Himanshu/Desktop/Windows/rt-cubed/src/embeddedLua/CMakeLists.txt 10>Target InitializeBuildStatus: 10> Creating "QtGUI.dir\Debug\QtGUI.tlog\unsuccessfulbuild" because "AlwaysCreate" was specified. 10>Target PreBuildEvent: 10> Automatic MOC for target QtGUI 3> Generating Code... 9>Target GetReferencedVCProjectsInfo: 8>Target GetReferencedVCProjectsInfo: 7>Target GetReferencedVCProjectsInfo: 9>Target ClCompile: 9> arb8.cpp 8>Target ClCompile: 8> PrintTitle.cpp 7>Target ClCompile: 7> cone.cpp 6> C:\Users\Himanshu\Desktop\Windows\rt-cubed\src\embeddedLua\arb8.cpp(146,53): warning C4244: 'argument': conversion from 'size_t' to 'lua_Number', possible loss of data 6> C:\Users\Himanshu\Desktop\Windows\rt-cubed\src\embeddedLua\arb8.cpp(157,26): warning C4244: 'initializing': conversion from 'lua_Number' to 'size_t', possible loss of data 6> C:\Users\Himanshu\Desktop\Windows\rt-cubed\src\embeddedLua\arb8.cpp(170,29): warning C4244: 'initializing': conversion from 'lua_Number' to 'size_t', possible loss of data 6> C:\Users\Himanshu\Desktop\Windows\rt-cubed\src\embeddedLua\arb8.cpp(184,26): warning C4244: 'initializing': conversion from 'lua_Number' to 'size_t', possible loss of data 6> C:\Users\Himanshu\Desktop\Windows\rt-cubed\src\embeddedLua\arb8.cpp(197,29): warning C4244: 'initializing': conversion from 'lua_Number' to 'size_t', possible loss of data 6> ellipsoid.cpp 6> C:\Users\Himanshu\Desktop\Windows\rt-cubed\src\embeddedLua\ellipsoid.cpp(141,31): warning C4244: 'initializing': conversion from 'lua_Number' to 'size_t', possible loss of data 6> C:\Users\Himanshu\Desktop\Windows\rt-cubed\src\embeddedLua\ellipsoid.cpp(154,42): warning C4244: 'initializing': conversion from 'lua_Number' to 'size_t', possible loss of data 6> C:\Users\Himanshu\Desktop\Windows\rt-cubed\src\embeddedLua\ellipsoid.cpp(195,40): warning C4244: 'initializing': conversion from 'lua_Number' to 'size_t', possible loss of data 9> C:\Users\Himanshu\Desktop\Windows\rt-cubed\src\embeddedLua\arb8.cpp(146,53): warning C4244: 'argument': conversion from 'size_t' to 'lua_Number', possible loss of data 9> C:\Users\Himanshu\Desktop\Windows\rt-cubed\src\embeddedLua\arb8.cpp(157,26): warning C4244: 'initializing': conversion from 'lua_Number' to 'size_t', possible loss of data 10>Target CustomBuild: 10> Building Custom Rule C:/Users/Himanshu/Desktop/Windows/rt-cubed/src/QtGUI/CMakeLists.txt 6> C:\Users\Himanshu\Desktop\Windows\rt-cubed\src\embeddedLua\ellipsoid.cpp(197,38): warning C4244: 'argument': conversion from 'size_t' to 'double', possible loss of data 6> ellipticaltorus.cpp 9> C:\Users\Himanshu\Desktop\Windows\rt-cubed\src\embeddedLua\arb8.cpp(170,29): warning C4244: 'initializing': conversion from 'lua_Number' to 'size_t', possible loss of data 9> C:\Users\Himanshu\Desktop\Windows\rt-cubed\src\embeddedLua\arb8.cpp(184,26): warning C4244: 'initializing': conversion from 'lua_Number' to 'size_t', possible loss of data 9> C:\Users\Himanshu\Desktop\Windows\rt-cubed\src\embeddedLua\arb8.cpp(197,29): warning C4244: 'initializing': conversion from 'lua_Number' to 'size_t', possible loss of data 9> ellipsoid.cpp 10>Target GetReferencedVCProjectsInfo: 6> embeddedlua.cpp 10>Target ClCompile: 10> mocs_compilation_Debug.cpp 9> C:\Users\Himanshu\Desktop\Windows\rt-cubed\src\embeddedLua\ellipsoid.cpp(141,31): warning C4244: 'initializing': conversion from 'lua_Number' to 'size_t', possible loss of data 9> C:\Users\Himanshu\Desktop\Windows\rt-cubed\src\embeddedLua\ellipsoid.cpp(154,42): warning C4244: 'initializing': conversion from 'lua_Number' to 'size_t', possible loss of data 9> C:\Users\Himanshu\Desktop\Windows\rt-cubed\src\embeddedLua\ellipsoid.cpp(195,40): warning C4244: 'initializing': conversion from 'lua_Number' to 'size_t', possible loss of data 9> C:\Users\Himanshu\Desktop\Windows\rt-cubed\src\embeddedLua\ellipsoid.cpp(197,38): warning C4244: 'argument': conversion from 'size_t' to 'double', possible loss of data 9> ellipticaltorus.cpp 9> embeddedlua.cpp 2>Target Lib: 2> ge-static.vcxproj -> C:\Users\Himanshu\Desktop\Windows\buildRT3\lib\ge-static.lib 2>Target GetCopyToOutputDirectoryItems: 2> Target _GetCopyToOutputDirectoryItemsFromTransitiveProjectReferences: 2>Target FinalizeBuildStatus: 2> Deleting file "ge-static.dir\Debug\ge-static.tlog\unsuccessfulbuild". 2> Touching "ge-static.dir\Debug\ge-static.tlog\ge-static.lastbuildstate". 2> 2>Build succeeded. 2> 0 Warning(s) 2> 0 Error(s) 2> 2>Time Elapsed 00:00:20.48 6> halfspace.cpp 8>Target Link: 8> printTitle.vcxproj -> C:\Users\Himanshu\Desktop\Windows\buildRT3\bin\printTitle.exe 8>Target GetCopyToOutputDirectoryItems: 8> Target _GetCopyToOutputDirectoryItemsFromTransitiveProjectReferences: 8>Target FinalizeBuildStatus: 8> Deleting file "printTitle.dir\Debug\printTitle.tlog\unsuccessfulbuild". 8> Touching "printTitle.dir\Debug\printTitle.tlog\printTitle.lastbuildstate". 8> 8>Build succeeded. 8> 0 Warning(s) 8> 0 Error(s) 8> 8>Time Elapsed 00:00:00.78 6> hyperboliccylinder.cpp 9> halfspace.cpp 6> hyperboloid.cpp 3>Target Link: 3> Pipe.obj : error LNK2001: unresolved external symbol bu_setjmp_valid 3> Sketch.obj : error LNK2001: unresolved external symbol bu_setjmp_valid 3> Sphere.obj : error LNK2001: unresolved external symbol bu_setjmp_valid 3> Torus.obj : error LNK2001: unresolved external symbol bu_setjmp_valid 3> Object.obj : error LNK2001: unresolved external symbol bu_setjmp_valid 3> ParabolicCylinder.obj : error LNK2001: unresolved external symbol bu_setjmp_valid 3> Paraboloid.obj : error LNK2001: unresolved external symbol bu_setjmp_valid 3> Particle.obj : error LNK2001: unresolved external symbol bu_setjmp_valid 3> HyperbolicCylinder.obj : error LNK2001: unresolved external symbol bu_setjmp_valid 3> Hyperboloid.obj : error LNK2001: unresolved external symbol bu_setjmp_valid 3> MemoryDatabase.obj : error LNK2001: unresolved external symbol bu_setjmp_valid 3> NonManifoldGeometry.obj : error LNK2001: unresolved external symbol bu_setjmp_valid 3> EllipticalTorus.obj : error LNK2001: unresolved external symbol bu_setjmp_valid 3> FileDatabase.obj : error LNK2001: unresolved external symbol bu_setjmp_valid 3> globals.obj : error LNK2001: unresolved external symbol bu_setjmp_valid 3> Halfspace.obj : error LNK2001: unresolved external symbol bu_setjmp_valid 3> Cone.obj : error LNK2001: unresolved external symbol bu_setjmp_valid 3> ConstDatabase.obj : error LNK2001: unresolved external symbol bu_setjmp_valid 3> Database.obj : error LNK2001: unresolved external symbol bu_setjmp_valid 3> Ellipsoid.obj : error LNK2001: unresolved external symbol bu_setjmp_valid 3> MinimalDatabase.obj : error LNK2001: unresolved external symbol bu_setjmp_valid 3> Arb8.obj : error LNK2001: unresolved external symbol bu_setjmp_valid 3> BagOfTriangles.obj : error LNK2001: unresolved external symbol bu_setjmp_valid 3> Combination.obj : error LNK2001: unresolved external symbol bu_setjmp_valid 3> Pipe.obj : error LNK2001: unresolved external symbol bu_jmpbuf 3> Sketch.obj : error LNK2001: unresolved external symbol bu_jmpbuf 3> Sphere.obj : error LNK2001: unresolved external symbol bu_jmpbuf 3> Torus.obj : error LNK2001: unresolved external symbol bu_jmpbuf 3> Object.obj : error LNK2001: unresolved external symbol bu_jmpbuf 3> ParabolicCylinder.obj : error LNK2001: unresolved external symbol bu_jmpbuf 3> Paraboloid.obj : error LNK2001: unresolved external symbol bu_jmpbuf 3> Particle.obj : error LNK2001: unresolved external symbol bu_jmpbuf 3> HyperbolicCylinder.obj : error LNK2001: unresolved external symbol bu_jmpbuf 3> Hyperboloid.obj : error LNK2001: unresolved external symbol bu_jmpbuf 3> MemoryDatabase.obj : error LNK2001: unresolved external symbol bu_jmpbuf 3> NonManifoldGeometry.obj : error LNK2001: unresolved external symbol bu_jmpbuf 3> EllipticalTorus.obj : error LNK2001: unresolved external symbol bu_jmpbuf 3> FileDatabase.obj : error LNK2001: unresolved external symbol bu_jmpbuf 3> globals.obj : error LNK2001: unresolved external symbol bu_jmpbuf 3> Halfspace.obj : error LNK2001: unresolved external symbol bu_jmpbuf 3> Cone.obj : error LNK2001: unresolved external symbol bu_jmpbuf 3> ConstDatabase.obj : error LNK2001: unresolved external symbol bu_jmpbuf 3> Database.obj : error LNK2001: unresolved external symbol bu_jmpbuf 3> Ellipsoid.obj : error LNK2001: unresolved external symbol bu_jmpbuf 3> MinimalDatabase.obj : error LNK2001: unresolved external symbol bu_jmpbuf 3> Arb8.obj : error LNK2001: unresolved external symbol bu_jmpbuf 3> BagOfTriangles.obj : error LNK2001: unresolved external symbol bu_jmpbuf 3> Combination.obj : error LNK2001: unresolved external symbol bu_jmpbuf 3> ConstDatabase.obj : error LNK2001: unresolved external symbol rt_uniresource 3> ConstDatabase.obj : error LNK2001: unresolved external symbol RTG 3> NonManifoldGeometry.obj : error LNK2001: unresolved external symbol RTG 3> C:\Users\Himanshu\Desktop\Windows\buildRT3\bin\ge.dll : fatal error LNK1120: 4 unresolved externals 3>Done building target "Link" in project "ge.vcxproj" -- FAILED. 3> 3>Done building project "ge.vcxproj" -- FAILED. 3> 3>Build FAILED. 3> 3>Pipe.obj : error LNK2001: unresolved external symbol bu_setjmp_valid 3>Sketch.obj : error LNK2001: unresolved external symbol bu_setjmp_valid 3>Sphere.obj : error LNK2001: unresolved external symbol bu_setjmp_valid 3>Torus.obj : error LNK2001: unresolved external symbol bu_setjmp_valid 3>Object.obj : error LNK2001: unresolved external symbol bu_setjmp_valid 3>ParabolicCylinder.obj : error LNK2001: unresolved external symbol bu_setjmp_valid 3>Paraboloid.obj : error LNK2001: unresolved external symbol bu_setjmp_valid 3>Particle.obj : error LNK2001: unresolved external symbol bu_setjmp_valid 3>HyperbolicCylinder.obj : error LNK2001: unresolved external symbol bu_setjmp_valid 3>Hyperboloid.obj : error LNK2001: unresolved external symbol bu_setjmp_valid 3>MemoryDatabase.obj : error LNK2001: unresolved external symbol bu_setjmp_valid 3>NonManifoldGeometry.obj : error LNK2001: unresolved external symbol bu_setjmp_valid 3>EllipticalTorus.obj : error LNK2001: unresolved external symbol bu_setjmp_valid 3>FileDatabase.obj : error LNK2001: unresolved external symbol bu_setjmp_valid 3>globals.obj : error LNK2001: unresolved external symbol bu_setjmp_valid 3>Halfspace.obj : error LNK2001: unresolved external symbol bu_setjmp_valid 3>Cone.obj : error LNK2001: unresolved external symbol bu_setjmp_valid 3>ConstDatabase.obj : error LNK2001: unresolved external symbol bu_setjmp_valid 3>Database.obj : error LNK2001: unresolved external symbol bu_setjmp_valid 3>Ellipsoid.obj : error LNK2001: unresolved external symbol bu_setjmp_valid 3>MinimalDatabase.obj : error LNK2001: unresolved external symbol bu_setjmp_valid 3>Arb8.obj : error LNK2001: unresolved external symbol bu_setjmp_valid 3>BagOfTriangles.obj : error LNK2001: unresolved external symbol bu_setjmp_valid 3>Combination.obj : error LNK2001: unresolved external symbol bu_setjmp_valid 3>Pipe.obj : error LNK2001: unresolved external symbol bu_jmpbuf 3>Sketch.obj : error LNK2001: unresolved external symbol bu_jmpbuf 3>Sphere.obj : error LNK2001: unresolved external symbol bu_jmpbuf 3>Torus.obj : error LNK2001: unresolved external symbol bu_jmpbuf 3>Object.obj : error LNK2001: unresolved external symbol bu_jmpbuf 3>ParabolicCylinder.obj : error LNK2001: unresolved external symbol bu_jmpbuf 3>Paraboloid.obj : error LNK2001: unresolved external symbol bu_jmpbuf 3>Particle.obj : error LNK2001: unresolved external symbol bu_jmpbuf 3>HyperbolicCylinder.obj : error LNK2001: unresolved external symbol bu_jmpbuf 3>Hyperboloid.obj : error LNK2001: unresolved external symbol bu_jmpbuf 3>MemoryDatabase.obj : error LNK2001: unresolved external symbol bu_jmpbuf 3>NonManifoldGeometry.obj : error LNK2001: unresolved external symbol bu_jmpbuf 3>EllipticalTorus.obj : error LNK2001: unresolved external symbol bu_jmpbuf 3>FileDatabase.obj : error LNK2001: unresolved external symbol bu_jmpbuf 3>globals.obj : error LNK2001: unresolved external symbol bu_jmpbuf 3>Halfspace.obj : error LNK2001: unresolved external symbol bu_jmpbuf 3>Cone.obj : error LNK2001: unresolved external symbol bu_jmpbuf 3>ConstDatabase.obj : error LNK2001: unresolved external symbol bu_jmpbuf 3>Database.obj : error LNK2001: unresolved external symbol bu_jmpbuf 3>Ellipsoid.obj : error LNK2001: unresolved external symbol bu_jmpbuf 3>MinimalDatabase.obj : error LNK2001: unresolved external symbol bu_jmpbuf 3>Arb8.obj : error LNK2001: unresolved external symbol bu_jmpbuf 3>BagOfTriangles.obj : error LNK2001: unresolved external symbol bu_jmpbuf 3>Combination.obj : error LNK2001: unresolved external symbol bu_jmpbuf 3>ConstDatabase.obj : error LNK2001: unresolved external symbol rt_uniresource 3>ConstDatabase.obj : error LNK2001: unresolved external symbol RTG 3>NonManifoldGeometry.obj : error LNK2001: unresolved external symbol RTG 3>C:\Users\Himanshu\Desktop\Windows\buildRT3\bin\ge.dll : fatal error LNK1120: 4 unresolved externals 3> 0 Warning(s) 3> 52 Error(s) 3> 3>Time Elapsed 00:00:20.68 11>------ Build started: Project: geTest, Configuration: Debug x64 ------ 9> hyperboliccylinder.cpp 6> initbrlcad.cpp 11>Build started 13-03-2022 07:49:32 PM. 11>Target ResolveProjectReferences: 11>Target PrepareForBuild: 11> Creating directory "geTest.dir\Debug\geTest.tlog\". 11>Target InitializeBuildStatus: 11> Creating "geTest.dir\Debug\geTest.tlog\unsuccessfulbuild" because "AlwaysCreate" was specified. 9> hyperboloid.cpp 11>Target CustomBuild: 11> Building Custom Rule C:/Users/Himanshu/Desktop/Windows/rt-cubed/tests/libge/CMakeLists.txt 11>Target GetReferencedVCProjectsInfo: 6> luadatabase.cpp 11>Target ClCompile: 11> GeometryEngineTest.cxx 9> initbrlcad.cpp 6> objectattributeiterator.cpp 7> ellipsoid.cpp 9> luadatabase.cpp 6> paraboliccylinder.cpp 9> objectattributeiterator.cpp 6> paraboloid.cpp 9> paraboliccylinder.cpp 6> particle.cpp 6> sphere.cpp 9> paraboloid.cpp 9> particle.cpp 6> torus.cpp 10> CameraView.cpp 9> sphere.cpp 6> vector3d.cpp 6> writestring.cpp 9> torus.cpp 9> vector3d.cpp 9> writestring.cpp 11>Target Link: 11> LINK : fatal error LNK1104: cannot open file '..\..\lib\ge.lib' 11>Done building target "Link" in project "geTest.vcxproj" -- FAILED. 11> 11>Done building project "geTest.vcxproj" -- FAILED. 11> 11>Build FAILED. 11> 11>LINK : fatal error LNK1104: cannot open file '..\..\lib\ge.lib' 11> 0 Warning(s) 11> 1 Error(s) 11> 11>Time Elapsed 00:00:00.87 7> halfspace.cpp 6> Generating Code... 9> Generating Code... 6> lapi.c 7> pipe.cpp 6> lcode.c 6> lctype.c 6> ldebug.c 6> ldo.c 9> lapi.c 6> ldump.c 6> lfunc.c 6> lgc.c 6> llex.c 9> lcode.c 9> lctype.c 6> lmem.c 6> lobject.c 6> lopcodes.c 6> lparser.c 10> GraphicView.cpp 9> ldebug.c 9> ldo.c 9> ldump.c 6> lstate.c 6> lstring.c 6> ltable.c 9> lfunc.c 9> lgc.c 9> llex.c 9> lmem.c 6> ltm.c 6> lundump.c 6> lvm.c 7> primitives.cpp 9> lobject.c 9> lopcodes.c 9> lparser.c 6> lzio.c 6> Generating Code... 9> lstate.c 9> lstring.c 9> ltable.c 9> ltm.c 6> Compiling... 6> lauxlib.c 9> lundump.c 9> lvm.c 9> lzio.c 9> Generating Code... 6> lbaselib.c 6> lbitlib.c 6> lcorolib.c 6> ldblib.c 9> Compiling... 9> lauxlib.c 6> liolib.c 6> lmathlib.c 6> loslib.c 7> sphere.cpp 9> lbaselib.c 9> lbitlib.c 6> lstrlib.c 6> ltablib.c 9> lcorolib.c 9> ldblib.c 9> liolib.c 6> lutf8lib.c 6> loadlib.c 9> lmathlib.c 9> loslib.c 9> lstrlib.c 9> ltablib.c 9> lutf8lib.c 9> loadlib.c 6> linit.c 7> Generating Code... 6> Generating Code... 10> LogView.cpp 6>Done building target "ClCompile" in project "embeddedlua-static.vcxproj". 9> linit.c 9> Generating Code... 6>Target Lib: 6> embeddedlua-static.vcxproj -> C:\Users\Himanshu\Desktop\Windows\buildRT3\lib\embeddedlua-static.lib 6>Target GetCopyToOutputDirectoryItems: 6> Target _GetCopyToOutputDirectoryItemsFromTransitiveProjectReferences: 9>Done building target "ClCompile" in project "embeddedlua.vcxproj". 9>Target Link: 9> Creating library C:/Users/Himanshu/Desktop/Windows/buildRT3/lib/embeddedlua.lib and object C:/Users/Himanshu/Desktop/Windows/buildRT3/lib/embeddedlua.exp 7>Target Link: 7> tester_ci_primitives.vcxproj -> C:\Users\Himanshu\Desktop\Windows\buildRT3\bin\tester_ci_primitives.exe 6>Target FinalizeBuildStatus: 6> Deleting file "embeddedlua-static.dir\Debug\embedded.758C2004.tlog\unsuccessfulbuild". 7>Target GetCopyToOutputDirectoryItems: 7> Target _GetCopyToOutputDirectoryItemsFromTransitiveProjectReferences: 7>Target FinalizeBuildStatus: 7> Deleting file "tester_ci_primitives.dir\Debug\tester_c.F0FDDC2C.tlog\unsuccessfulbuild". 7> Touching "tester_ci_primitives.dir\Debug\tester_c.F0FDDC2C.tlog\tester_ci_primitives.lastbuildstate". 7> 7>Build succeeded. 7> 0 Warning(s) 7> 0 Error(s) 7> 7>Time Elapsed 00:00:03.65 6> Touching "embeddedlua-static.dir\Debug\embedded.758C2004.tlog\embeddedlua-static.lastbuildstate". 6> 6>Done building project "embeddedlua-static.vcxproj". 6> 6>Build succeeded. 6> 6>C:\Users\Himanshu\Desktop\Windows\rt-cubed\src\embeddedLua\arb8.cpp(146,53): warning C4244: 'argument': conversion from 'size_t' to 'lua_Number', possible loss of data 6>C:\Users\Himanshu\Desktop\Windows\rt-cubed\src\embeddedLua\arb8.cpp(157,26): warning C4244: 'initializing': conversion from 'lua_Number' to 'size_t', possible loss of data 6>C:\Users\Himanshu\Desktop\Windows\rt-cubed\src\embeddedLua\arb8.cpp(170,29): warning C4244: 'initializing': conversion from 'lua_Number' to 'size_t', possible loss of data 6>C:\Users\Himanshu\Desktop\Windows\rt-cubed\src\embeddedLua\arb8.cpp(184,26): warning C4244: 'initializing': conversion from 'lua_Number' to 'size_t', possible loss of data 6>C:\Users\Himanshu\Desktop\Windows\rt-cubed\src\embeddedLua\arb8.cpp(197,29): warning C4244: 'initializing': conversion from 'lua_Number' to 'size_t', possible loss of data 6>C:\Users\Himanshu\Desktop\Windows\rt-cubed\src\embeddedLua\ellipsoid.cpp(141,31): warning C4244: 'initializing': conversion from 'lua_Number' to 'size_t', possible loss of data 6>C:\Users\Himanshu\Desktop\Windows\rt-cubed\src\embeddedLua\ellipsoid.cpp(154,42): warning C4244: 'initializing': conversion from 'lua_Number' to 'size_t', possible loss of data 6>C:\Users\Himanshu\Desktop\Windows\rt-cubed\src\embeddedLua\ellipsoid.cpp(195,40): warning C4244: 'initializing': conversion from 'lua_Number' to 'size_t', possible loss of data 6>C:\Users\Himanshu\Desktop\Windows\rt-cubed\src\embeddedLua\ellipsoid.cpp(197,38): warning C4244: 'argument': conversion from 'size_t' to 'double', possible loss of data 6> 9 Warning(s) 6> 0 Error(s) 6> 6>Time Elapsed 00:00:03.77 9> embeddedlua.vcxproj -> C:\Users\Himanshu\Desktop\Windows\buildRT3\bin\embeddedlua.dll 9>Target GetCopyToOutputDirectoryItems: 9> Target _GetCopyToOutputDirectoryItemsFromTransitiveProjectReferences: 9>Target FinalizeBuildStatus: 9> Deleting file "embeddedlua.dir\Debug\embeddedlua.tlog\unsuccessfulbuild". 9> Touching "embeddedlua.dir\Debug\embeddedlua.tlog\embeddedlua.lastbuildstate". 9> 9>Done building project "embeddedlua.vcxproj". 9> 9>Build succeeded. 9> 9>C:\Users\Himanshu\Desktop\Windows\rt-cubed\src\embeddedLua\arb8.cpp(146,53): warning C4244: 'argument': conversion from 'size_t' to 'lua_Number', possible loss of data 9>C:\Users\Himanshu\Desktop\Windows\rt-cubed\src\embeddedLua\arb8.cpp(157,26): warning C4244: 'initializing': conversion from 'lua_Number' to 'size_t', possible loss of data 9>C:\Users\Himanshu\Desktop\Windows\rt-cubed\src\embeddedLua\arb8.cpp(170,29): warning C4244: 'initializing': conversion from 'lua_Number' to 'size_t', possible loss of data 9>C:\Users\Himanshu\Desktop\Windows\rt-cubed\src\embeddedLua\arb8.cpp(184,26): warning C4244: 'initializing': conversion from 'lua_Number' to 'size_t', possible loss of data 9>C:\Users\Himanshu\Desktop\Windows\rt-cubed\src\embeddedLua\arb8.cpp(197,29): warning C4244: 'initializing': conversion from 'lua_Number' to 'size_t', possible loss of data 9>C:\Users\Himanshu\Desktop\Windows\rt-cubed\src\embeddedLua\ellipsoid.cpp(141,31): warning C4244: 'initializing': conversion from 'lua_Number' to 'size_t', possible loss of data 9>C:\Users\Himanshu\Desktop\Windows\rt-cubed\src\embeddedLua\ellipsoid.cpp(154,42): warning C4244: 'initializing': conversion from 'lua_Number' to 'size_t', possible loss of data 9>C:\Users\Himanshu\Desktop\Windows\rt-cubed\src\embeddedLua\ellipsoid.cpp(195,40): warning C4244: 'initializing': conversion from 'lua_Number' to 'size_t', possible loss of data 9>C:\Users\Himanshu\Desktop\Windows\rt-cubed\src\embeddedLua\ellipsoid.cpp(197,38): warning C4244: 'argument': conversion from 'size_t' to 'double', possible loss of data 9> 9 Warning(s) 9> 0 Error(s) 9> 9>Time Elapsed 00:00:03.75 12>------ Build started: Project: selectunselect, Configuration: Debug x64 ------ 13>------ Build started: Project: helloworld, Configuration: Debug x64 ------ 14>------ Build started: Project: hellobrlcad, Configuration: Debug x64 ------ 15>------ Build started: Project: databasetitle, Configuration: Debug x64 ------ 16>------ Build started: Project: boundingbox, Configuration: Debug x64 ------ 12>Build started 13-03-2022 07:49:35 PM. 12>Target ResolveProjectReferences: 12>Target PrepareForBuild: 12> Creating directory "selectunselect.dir\Debug\selectunselect.tlog\". 13>Build started 13-03-2022 07:49:35 PM. 13>Target ResolveProjectReferences: 14>Build started 13-03-2022 07:49:35 PM. 14>Target ResolveProjectReferences: 14>Target PrepareForBuild: 14> Creating directory "hellobrlcad.dir\Debug\hellobrlcad.tlog\". 14>Target InitializeBuildStatus: 14> Creating "hellobrlcad.dir\Debug\hellobrlcad.tlog\unsuccessfulbuild" because "AlwaysCreate" was specified. 15>Build started 13-03-2022 07:49:35 PM. 15>Target ResolveProjectReferences: 15>Target PrepareForBuild: 15> Creating directory "databasetitle.dir\Debug\databasetitle.tlog\". 15>Target InitializeBuildStatus: 15> Creating "databasetitle.dir\Debug\databasetitle.tlog\unsuccessfulbuild" because "AlwaysCreate" was specified. 16>Build started 13-03-2022 07:49:35 PM. 16>Target ResolveProjectReferences: 16>Target PrepareForBuild: 16> Creating directory "boundingbox.dir\Debug\boundingbox.tlog\". 16>Target InitializeBuildStatus: 16> Creating "boundingbox.dir\Debug\boundingbox.tlog\unsuccessfulbuild" because "AlwaysCreate" was specified. 13>Target PrepareForBuild: 13> Creating directory "helloworld.dir\Debug\helloworld.tlog\". 13>Target InitializeBuildStatus: 13> Creating "helloworld.dir\Debug\helloworld.tlog\unsuccessfulbuild" because "AlwaysCreate" was specified. 13>Target CustomBuild: 13> Building Custom Rule C:/Users/Himanshu/Desktop/Windows/rt-cubed/tests/embeddedLua/CMakeLists.txt 12>Target InitializeBuildStatus: 12> Creating "selectunselect.dir\Debug\selectunselect.tlog\unsuccessfulbuild" because "AlwaysCreate" was specified. 12>Target CustomBuild: 12> Building Custom Rule C:/Users/Himanshu/Desktop/Windows/rt-cubed/tests/embeddedLua/CMakeLists.txt 14>Target CustomBuild: 14> Building Custom Rule C:/Users/Himanshu/Desktop/Windows/rt-cubed/tests/embeddedLua/CMakeLists.txt 14>Target GetReferencedVCProjectsInfo: 16>Target CustomBuild: 16> Building Custom Rule C:/Users/Himanshu/Desktop/Windows/rt-cubed/tests/embeddedLua/CMakeLists.txt 16>Target GetReferencedVCProjectsInfo: 15>Target CustomBuild: 15> Building Custom Rule C:/Users/Himanshu/Desktop/Windows/rt-cubed/tests/embeddedLua/CMakeLists.txt 15>Target GetReferencedVCProjectsInfo: 15>Target ClCompile: 15> databasetitle.cpp 14>Target ClCompile: 14> hellobrlcad.cpp 16>Target ClCompile: 16> boundingbox.cpp 10> main.cpp 12>Target GetReferencedVCProjectsInfo: 15>Target Link: 15> databasetitle.vcxproj -> C:\Users\Himanshu\Desktop\Windows\buildRT3\bin\databasetitle.exe 14>Target Link: 14> hellobrlcad.vcxproj -> C:\Users\Himanshu\Desktop\Windows\buildRT3\bin\hellobrlcad.exe 12>Target ClCompile: 12> selectunselect.cpp 15>Target GetCopyToOutputDirectoryItems: 15> Target _GetCopyToOutputDirectoryItemsFromTransitiveProjectReferences: 14>Target GetCopyToOutputDirectoryItems: 14> Target _GetCopyToOutputDirectoryItemsFromTransitiveProjectReferences: 16>Target Link: 16> boundingbox.vcxproj -> C:\Users\Himanshu\Desktop\Windows\buildRT3\bin\boundingbox.exe 16>Target GetCopyToOutputDirectoryItems: 16> Target _GetCopyToOutputDirectoryItemsFromTransitiveProjectReferences: 16>Target FinalizeBuildStatus: 16> Deleting file "boundingbox.dir\Debug\boundingbox.tlog\unsuccessfulbuild". 16> Touching "boundingbox.dir\Debug\boundingbox.tlog\boundingbox.lastbuildstate". 16> 16>Build succeeded. 16> 0 Warning(s) 16> 0 Error(s) 16> 16>Time Elapsed 00:00:00.79 14>Target FinalizeBuildStatus: 14> Deleting file "hellobrlcad.dir\Debug\hellobrlcad.tlog\unsuccessfulbuild". 14> Touching "hellobrlcad.dir\Debug\hellobrlcad.tlog\hellobrlcad.lastbuildstate". 14> 14>Build succeeded. 14> 0 Warning(s) 14> 0 Error(s) 14> 14>Time Elapsed 00:00:00.80 15>Target FinalizeBuildStatus: 15> Deleting file "databasetitle.dir\Debug\databasetitle.tlog\unsuccessfulbuild". 15> Touching "databasetitle.dir\Debug\databasetitle.tlog\databasetitle.lastbuildstate". 15> 15>Build succeeded. 15> 0 Warning(s) 15> 0 Error(s) 15> 15>Time Elapsed 00:00:00.80 13>Target GetReferencedVCProjectsInfo: 12>Target Link: 12> selectunselect.vcxproj -> C:\Users\Himanshu\Desktop\Windows\buildRT3\bin\selectunselect.exe 12>Target GetCopyToOutputDirectoryItems: 12> Target _GetCopyToOutputDirectoryItemsFromTransitiveProjectReferences: 12>Target FinalizeBuildStatus: 12> Deleting file "selectunselect.dir\Debug\selectunselect.tlog\unsuccessfulbuild". 12> Touching "selectunselect.dir\Debug\selectunselect.tlog\selectunselect.lastbuildstate". 12> 12>Build succeeded. 12> 0 Warning(s) 12> 0 Error(s) 12> 12>Time Elapsed 00:00:01.16 13>Target ClCompile: 13> helloworld.cpp 10> MainWindow.cpp 13>Target Link: 13> helloworld.vcxproj -> C:\Users\Himanshu\Desktop\Windows\buildRT3\bin\helloworld.exe 13>Target GetCopyToOutputDirectoryItems: 13> Target _GetCopyToOutputDirectoryItemsFromTransitiveProjectReferences: 13>Target FinalizeBuildStatus: 13> Deleting file "helloworld.dir\Debug\helloworld.tlog\unsuccessfulbuild". 13> Touching "helloworld.dir\Debug\helloworld.tlog\helloworld.lastbuildstate". 13> 13>Build succeeded. 13> 0 Warning(s) 13> 0 Error(s) 13> 13>Time Elapsed 00:00:01.62 10> ObjectsTreeView.cpp 10> Generating Code... 10>Target Link: 10> QtGUI.vcxproj -> C:\Users\Himanshu\Desktop\Windows\buildRT3\bin\QtGUI.exe 10>Target GetCopyToOutputDirectoryItems: 10> Target _GetCopyToOutputDirectoryItemsFromTransitiveProjectReferences: 10>Target FinalizeBuildStatus: 10> Deleting file "QtGUI.dir\Debug\QtGUI.tlog\unsuccessfulbuild". 10> Touching "QtGUI.dir\Debug\QtGUI.tlog\QtGUI.lastbuildstate". 10> 10>Build succeeded. 10> 0 Warning(s) 10> 0 Error(s) 10> 10>Time Elapsed 00:00:07.30 17>------ Build started: Project: ALL_BUILD, Configuration: Debug x64 ------ 17>Build started 13-03-2022 07:49:39 PM. 17>Target ResolveProjectReferences: 17> Target GetTargetPathWithTargetPlatformMoniker: 17> Target GetTargetPathWithTargetPlatformMoniker: 17> Target GetTargetPathWithTargetPlatformMoniker: 17> Target GetTargetPathWithTargetPlatformMoniker: 17> Target GetTargetPathWithTargetPlatformMoniker: 17> Target GetNativeManifest: 17> Target GetNativeManifest: 17> Target GetNativeManifest: 17>Target PrepareForBuild: 17> Creating directory "x64\Debug\ALL_BUILD\ALL_BUILD.tlog\". 17>Target InitializeBuildStatus: 17> Creating "x64\Debug\ALL_BUILD\ALL_BUILD.tlog\unsuccessfulbuild" because "AlwaysCreate" was specified. 17>Target CustomBuild: 17> Building Custom Rule C:/Users/Himanshu/Desktop/Windows/rt-cubed/CMakeLists.txt 17>Target GetReferencedVCProjectsInfo: 17> Target GetPublicIncludeDirectories: 17> Target AddPublicIncludeDirectoriesToProjectsInfoForReference: 17> Target AddLibrariesToProjectsInfoForReference: 17> Target AddDeployRecipeFileToProjectsInfoForReference: 17> Target GetResolvedLinkLibs: 17>Target FinalizeBuildStatus: 17> Deleting file "x64\Debug\ALL_BUILD\ALL_BUILD.tlog\unsuccessfulbuild". 17> Touching "x64\Debug\ALL_BUILD\ALL_BUILD.tlog\ALL_BUILD.lastbuildstate". 17> 17>Build succeeded. 17> 0 Warning(s) 17> 0 Error(s) 17> 17>Time Elapsed 00:00:00.09 ========== Build: 15 succeeded, 2 failed, 0 up-to-date, 0 skipped ==========
Editor is loading...