Untitled

mail@pastecode.io avatar
unknown
plain_text
7 months ago
2.9 kB
3
Indexable
Never
PS D:\PKL\Coedev\riderunner_food> fvm list
Cache Directory:  C:\Users\ASUS\fvm\versions

3.3.9 (active)
2.13.0-0.4.pre
2.10.5
2.10.4
PS D:\PKL\Coedev\riderunner_food> fvm flutter run
Downloading android-arm-profile/windows-x64 tools...             1,307ms
Downloading android-arm-release/windows-x64 tools...             1,571ms
Downloading android-arm64-profile/windows-x64 tools...           1,749ms
Downloading android-arm64-release/windows-x64 tools...           1,699ms
Downloading android-x64-profile/windows-x64 tools...             1,919ms
Downloading android-x64-release/windows-x64 tools...             1,675ms
Downloading Web SDK...                                              8.1s
Downloading CanvasKit...                                            4.4s
Downloading windows-x64/windows-x64-flutter tools...               18.4s
Downloading windows-x64/flutter-cpp-client-wrapper tools...        515ms
Downloading windows-x64-profile/windows-x64-flutter tools...        15.0s
Downloading windows-x64-release/windows-x64-flutter tools...        11.8s
Using hardware rendering with device sdk gphone64 x86 64. If you notice graphics artifacts, consider enabling software rendering with "--enable-software-rendering".
Launching lib\main.dart on sdk gphone64 x86 64 in debug mode...
Running Gradle task 'assembleDebug'...

FAILURE: Build completed with 2 failures.

1: Task failed with an exception.
-----------
* Where:
Build file 'C:\Users\ASUS\AppData\Local\Pub\Cache\hosted\pub.dartlang.org\mapbox_gl-0.16.0\android\build.gradle' line: 18

* What went wrong:
A problem occurred evaluating project ':mapbox_gl'.
> SDK Registry token is null. See README.md for more information.

* Try:
> Run with --stacktrace option to get the stack trace.
> Run with --info or --debug option to get more log output.
> Run with --scan to get full insights.
==============================================================================

2: Task failed with an exception.
-----------
* Where:
Script 'C:\Users\ASUS\fvm\versions\3.3.9\packages\flutter_tools\gradle\flutter.gradle' line: 418

* What went wrong:
A problem occurred configuring project ':mapbox_gl'.
> Failed to notify project evaluation listener.
   > Could not get unknown property 'android' for project ':mapbox_gl' of type org.gradle.api.Project.
   > Could not get unknown property 'android' for project ':mapbox_gl' of type org.gradle.api.Project.

* Try:
> Run with --stacktrace option to get the stack trace.
> Run with --info or --debug option to get more log output.
> Run with --scan to get full insights.
==============================================================================

* Get more help at https://help.gradle.org

BUILD FAILED in 34s
Running Gradle task 'assembleDebug'...                             36.6s
Exception: Gradle task assembleDebug failed with exit code 1
PS D:\PKL\Coedev\riderunner_food> 
Leave a Comment