Nikita_Komissarov

mail@pastecode.io avatar
unknown
powershell
2 years ago
67 kB
33
Indexable
Never
komissarov@pc:~/project/potato$ npm install
npm WARN deprecated har-validator@5.1.5: this library is no longer supported
npm WARN deprecated urix@0.1.0: Please see https://github.com/lydell/urix#deprecated
npm WARN deprecated object-keys@0.2.0: Please update to the latest object-keys
npm WARN deprecated resolve-url@0.2.1: https://github.com/lydell/resolve-url#deprecated
npm WARN deprecated chokidar@2.1.8: Chokidar 2 will break on node v14+. Upgrade to chokidar 3 with 15x less dependencies.
npm WARN deprecated uuid@3.4.0: Please upgrade  to version 7 or higher.  Older versions may use Math.random() in certain circumstances, which is known to be problematic.  See https://v8.dev/blog/math-random for details.
npm WARN deprecated request@2.88.2: request has been deprecated, see https://github.com/request/request/issues/3142
npm WARN deprecated tar@2.2.2: This version of tar is no longer supported, and will not receive security updates. Please upgrade asap.
npm WARN deprecated popper.js@1.16.1: You can find the new Popper v2 at @popperjs/core, this package is dedicated to the legacy v1
npm WARN deprecated core-js@2.6.12: core-js@<3.3 is no longer maintained and not recommended for usage due to the number of issues. Because of the V8 engine whims, feature detection in old core-js versions could cause a slowdown up to 100x even if nothing is polyfilled. Please, upgrade your dependencies to the actual version of core-js.
npm ERR! code 1
npm ERR! path /home/komissarov/project/potato/node_modules/gulp-sass/node_modules/node-sass
npm ERR! command failed
npm ERR! command sh -c node scripts/build.js
npm ERR! Building: /usr/bin/node /home/komissarov/project/potato/node_modules/gulp-sass/node_modules/node-gyp/bin/node-gyp.js rebuild --verbose --libsass_ext= --libsass_cflags= --libsass_ldflags= --libsass_library=
npm ERR! make: вход в каталог «/home/komissarov/project/potato/node_modules/gulp-sass/node_modules/node-sass/build»
npm ERR!   g++ '-DNODE_GYP_MODULE_NAME=libsass' '-DUSING_UV_SHARED=1' '-DUSING_V8_SHARED=1' '-DV8_DEPRECATION_WARNINGS=1' '-DV8_DEPRECATION_WARNINGS' '-DV8_IMMINENT_DEPRECATION_WARNINGS' '-D_GLIBCXX_USE_CXX11_ABI=1' '-D_LARGEFILE_SOURCE' '-D_FILE_OFFSET_BITS=64' '-D__STDC_FORMAT_MACROS' '-DOPENSSL_NO_PINSHARED' '-DOPENSSL_THREADS' '-DLIBSASS_VERSION="3.5.5"' -I/home/komissarov/.node-gyp/16.11.1/include/node -I/home/komissarov/.node-gyp/16.11.1/src -I/home/komissarov/.node-gyp/16.11.1/deps/openssl/config -I/home/komissarov/.node-gyp/16.11.1/deps/openssl/openssl/include -I/home/komissarov/.node-gyp/16.11.1/deps/uv/include -I/home/komissarov/.node-gyp/16.11.1/deps/zlib -I/home/komissarov/.node-gyp/16.11.1/deps/v8/include -I../src/libsass/include  -fPIC -pthread -Wall -Wextra -Wno-unused-parameter -m64 -O3 -fno-omit-frame-pointer -std=gnu++14 -std=c++0x -fexceptions -frtti -MMD -MF ./Release/.deps/Release/obj.target/libsass/src/libsass/src/ast.o.d.raw   -c -o Release/obj.target/libsass/src/libsass/src/ast.o ../src/libsass/src/ast.cpp
npm ERR!   g++ '-DNODE_GYP_MODULE_NAME=libsass' '-DUSING_UV_SHARED=1' '-DUSING_V8_SHARED=1' '-DV8_DEPRECATION_WARNINGS=1' '-DV8_DEPRECATION_WARNINGS' '-DV8_IMMINENT_DEPRECATION_WARNINGS' '-D_GLIBCXX_USE_CXX11_ABI=1' '-D_LARGEFILE_SOURCE' '-D_FILE_OFFSET_BITS=64' '-D__STDC_FORMAT_MACROS' '-DOPENSSL_NO_PINSHARED' '-DOPENSSL_THREADS' '-DLIBSASS_VERSION="3.5.5"' -I/home/komissarov/.node-gyp/16.11.1/include/node -I/home/komissarov/.node-gyp/16.11.1/src -I/home/komissarov/.node-gyp/16.11.1/deps/openssl/config -I/home/komissarov/.node-gyp/16.11.1/deps/openssl/openssl/include -I/home/komissarov/.node-gyp/16.11.1/deps/uv/include -I/home/komissarov/.node-gyp/16.11.1/deps/zlib -I/home/komissarov/.node-gyp/16.11.1/deps/v8/include -I../src/libsass/include  -fPIC -pthread -Wall -Wextra -Wno-unused-parameter -m64 -O3 -fno-omit-frame-pointer -std=gnu++14 -std=c++0x -fexceptions -frtti -MMD -MF ./Release/.deps/Release/obj.target/libsass/src/libsass/src/ast_fwd_decl.o.d.raw   -c -o Release/obj.target/libsass/src/libsass/src/ast_fwd_decl.o ../src/libsass/src/ast_fwd_decl.cpp
npm ERR!   g++ '-DNODE_GYP_MODULE_NAME=libsass' '-DUSING_UV_SHARED=1' '-DUSING_V8_SHARED=1' '-DV8_DEPRECATION_WARNINGS=1' '-DV8_DEPRECATION_WARNINGS' '-DV8_IMMINENT_DEPRECATION_WARNINGS' '-D_GLIBCXX_USE_CXX11_ABI=1' '-D_LARGEFILE_SOURCE' '-D_FILE_OFFSET_BITS=64' '-D__STDC_FORMAT_MACROS' '-DOPENSSL_NO_PINSHARED' '-DOPENSSL_THREADS' '-DLIBSASS_VERSION="3.5.5"' -I/home/komissarov/.node-gyp/16.11.1/include/node -I/home/komissarov/.node-gyp/16.11.1/src -I/home/komissarov/.node-gyp/16.11.1/deps/openssl/config -I/home/komissarov/.node-gyp/16.11.1/deps/openssl/openssl/include -I/home/komissarov/.node-gyp/16.11.1/deps/uv/include -I/home/komissarov/.node-gyp/16.11.1/deps/zlib -I/home/komissarov/.node-gyp/16.11.1/deps/v8/include -I../src/libsass/include  -fPIC -pthread -Wall -Wextra -Wno-unused-parameter -m64 -O3 -fno-omit-frame-pointer -std=gnu++14 -std=c++0x -fexceptions -frtti -MMD -MF ./Release/.deps/Release/obj.target/libsass/src/libsass/src/backtrace.o.d.raw   -c -o Release/obj.target/libsass/src/libsass/src/backtrace.o ../src/libsass/src/backtrace.cpp
npm ERR!   g++ '-DNODE_GYP_MODULE_NAME=libsass' '-DUSING_UV_SHARED=1' '-DUSING_V8_SHARED=1' '-DV8_DEPRECATION_WARNINGS=1' '-DV8_DEPRECATION_WARNINGS' '-DV8_IMMINENT_DEPRECATION_WARNINGS' '-D_GLIBCXX_USE_CXX11_ABI=1' '-D_LARGEFILE_SOURCE' '-D_FILE_OFFSET_BITS=64' '-D__STDC_FORMAT_MACROS' '-DOPENSSL_NO_PINSHARED' '-DOPENSSL_THREADS' '-DLIBSASS_VERSION="3.5.5"' -I/home/komissarov/.node-gyp/16.11.1/include/node -I/home/komissarov/.node-gyp/16.11.1/src -I/home/komissarov/.node-gyp/16.11.1/deps/openssl/config -I/home/komissarov/.node-gyp/16.11.1/deps/openssl/openssl/include -I/home/komissarov/.node-gyp/16.11.1/deps/uv/include -I/home/komissarov/.node-gyp/16.11.1/deps/zlib -I/home/komissarov/.node-gyp/16.11.1/deps/v8/include -I../src/libsass/include  -fPIC -pthread -Wall -Wextra -Wno-unused-parameter -m64 -O3 -fno-omit-frame-pointer -std=gnu++14 -std=c++0x -fexceptions -frtti -MMD -MF ./Release/.deps/Release/obj.target/libsass/src/libsass/src/base64vlq.o.d.raw   -c -o Release/obj.target/libsass/src/libsass/src/base64vlq.o ../src/libsass/src/base64vlq.cpp
npm ERR!   g++ '-DNODE_GYP_MODULE_NAME=libsass' '-DUSING_UV_SHARED=1' '-DUSING_V8_SHARED=1' '-DV8_DEPRECATION_WARNINGS=1' '-DV8_DEPRECATION_WARNINGS' '-DV8_IMMINENT_DEPRECATION_WARNINGS' '-D_GLIBCXX_USE_CXX11_ABI=1' '-D_LARGEFILE_SOURCE' '-D_FILE_OFFSET_BITS=64' '-D__STDC_FORMAT_MACROS' '-DOPENSSL_NO_PINSHARED' '-DOPENSSL_THREADS' '-DLIBSASS_VERSION="3.5.5"' -I/home/komissarov/.node-gyp/16.11.1/include/node -I/home/komissarov/.node-gyp/16.11.1/src -I/home/komissarov/.node-gyp/16.11.1/deps/openssl/config -I/home/komissarov/.node-gyp/16.11.1/deps/openssl/openssl/include -I/home/komissarov/.node-gyp/16.11.1/deps/uv/include -I/home/komissarov/.node-gyp/16.11.1/deps/zlib -I/home/komissarov/.node-gyp/16.11.1/deps/v8/include -I../src/libsass/include  -fPIC -pthread -Wall -Wextra -Wno-unused-parameter -m64 -O3 -fno-omit-frame-pointer -std=gnu++14 -std=c++0x -fexceptions -frtti -MMD -MF ./Release/.deps/Release/obj.target/libsass/src/libsass/src/bind.o.d.raw   -c -o Release/obj.target/libsass/src/libsass/src/bind.o ../src/libsass/src/bind.cpp
npm ERR!   cc '-DNODE_GYP_MODULE_NAME=libsass' '-DUSING_UV_SHARED=1' '-DUSING_V8_SHARED=1' '-DV8_DEPRECATION_WARNINGS=1' '-DV8_DEPRECATION_WARNINGS' '-DV8_IMMINENT_DEPRECATION_WARNINGS' '-D_GLIBCXX_USE_CXX11_ABI=1' '-D_LARGEFILE_SOURCE' '-D_FILE_OFFSET_BITS=64' '-D__STDC_FORMAT_MACROS' '-DOPENSSL_NO_PINSHARED' '-DOPENSSL_THREADS' '-DLIBSASS_VERSION="3.5.5"' -I/home/komissarov/.node-gyp/16.11.1/include/node -I/home/komissarov/.node-gyp/16.11.1/src -I/home/komissarov/.node-gyp/16.11.1/deps/openssl/config -I/home/komissarov/.node-gyp/16.11.1/deps/openssl/openssl/include -I/home/komissarov/.node-gyp/16.11.1/deps/uv/include -I/home/komissarov/.node-gyp/16.11.1/deps/zlib -I/home/komissarov/.node-gyp/16.11.1/deps/v8/include -I../src/libsass/include  -fPIC -pthread -Wall -Wextra -Wno-unused-parameter -m64 -O3 -fno-omit-frame-pointer  -MMD -MF ./Release/.deps/Release/obj.target/libsass/src/libsass/src/cencode.o.d.raw   -c -o Release/obj.target/libsass/src/libsass/src/cencode.o ../src/libsass/src/cencode.c
npm ERR!   g++ '-DNODE_GYP_MODULE_NAME=libsass' '-DUSING_UV_SHARED=1' '-DUSING_V8_SHARED=1' '-DV8_DEPRECATION_WARNINGS=1' '-DV8_DEPRECATION_WARNINGS' '-DV8_IMMINENT_DEPRECATION_WARNINGS' '-D_GLIBCXX_USE_CXX11_ABI=1' '-D_LARGEFILE_SOURCE' '-D_FILE_OFFSET_BITS=64' '-D__STDC_FORMAT_MACROS' '-DOPENSSL_NO_PINSHARED' '-DOPENSSL_THREADS' '-DLIBSASS_VERSION="3.5.5"' -I/home/komissarov/.node-gyp/16.11.1/include/node -I/home/komissarov/.node-gyp/16.11.1/src -I/home/komissarov/.node-gyp/16.11.1/deps/openssl/config -I/home/komissarov/.node-gyp/16.11.1/deps/openssl/openssl/include -I/home/komissarov/.node-gyp/16.11.1/deps/uv/include -I/home/komissarov/.node-gyp/16.11.1/deps/zlib -I/home/komissarov/.node-gyp/16.11.1/deps/v8/include -I../src/libsass/include  -fPIC -pthread -Wall -Wextra -Wno-unused-parameter -m64 -O3 -fno-omit-frame-pointer -std=gnu++14 -std=c++0x -fexceptions -frtti -MMD -MF ./Release/.deps/Release/obj.target/libsass/src/libsass/src/check_nesting.o.d.raw   -c -o Release/obj.target/libsass/src/libsass/src/check_nesting.o ../src/libsass/src/check_nesting.cpp
npm ERR!   g++ '-DNODE_GYP_MODULE_NAME=libsass' '-DUSING_UV_SHARED=1' '-DUSING_V8_SHARED=1' '-DV8_DEPRECATION_WARNINGS=1' '-DV8_DEPRECATION_WARNINGS' '-DV8_IMMINENT_DEPRECATION_WARNINGS' '-D_GLIBCXX_USE_CXX11_ABI=1' '-D_LARGEFILE_SOURCE' '-D_FILE_OFFSET_BITS=64' '-D__STDC_FORMAT_MACROS' '-DOPENSSL_NO_PINSHARED' '-DOPENSSL_THREADS' '-DLIBSASS_VERSION="3.5.5"' -I/home/komissarov/.node-gyp/16.11.1/include/node -I/home/komissarov/.node-gyp/16.11.1/src -I/home/komissarov/.node-gyp/16.11.1/deps/openssl/config -I/home/komissarov/.node-gyp/16.11.1/deps/openssl/openssl/include -I/home/komissarov/.node-gyp/16.11.1/deps/uv/include -I/home/komissarov/.node-gyp/16.11.1/deps/zlib -I/home/komissarov/.node-gyp/16.11.1/deps/v8/include -I../src/libsass/include  -fPIC -pthread -Wall -Wextra -Wno-unused-parameter -m64 -O3 -fno-omit-frame-pointer -std=gnu++14 -std=c++0x -fexceptions -frtti -MMD -MF ./Release/.deps/Release/obj.target/libsass/src/libsass/src/color_maps.o.d.raw   -c -o Release/obj.target/libsass/src/libsass/src/color_maps.o ../src/libsass/src/color_maps.cpp
npm ERR!   g++ '-DNODE_GYP_MODULE_NAME=libsass' '-DUSING_UV_SHARED=1' '-DUSING_V8_SHARED=1' '-DV8_DEPRECATION_WARNINGS=1' '-DV8_DEPRECATION_WARNINGS' '-DV8_IMMINENT_DEPRECATION_WARNINGS' '-D_GLIBCXX_USE_CXX11_ABI=1' '-D_LARGEFILE_SOURCE' '-D_FILE_OFFSET_BITS=64' '-D__STDC_FORMAT_MACROS' '-DOPENSSL_NO_PINSHARED' '-DOPENSSL_THREADS' '-DLIBSASS_VERSION="3.5.5"' -I/home/komissarov/.node-gyp/16.11.1/include/node -I/home/komissarov/.node-gyp/16.11.1/src -I/home/komissarov/.node-gyp/16.11.1/deps/openssl/config -I/home/komissarov/.node-gyp/16.11.1/deps/openssl/openssl/include -I/home/komissarov/.node-gyp/16.11.1/deps/uv/include -I/home/komissarov/.node-gyp/16.11.1/deps/zlib -I/home/komissarov/.node-gyp/16.11.1/deps/v8/include -I../src/libsass/include  -fPIC -pthread -Wall -Wextra -Wno-unused-parameter -m64 -O3 -fno-omit-frame-pointer -std=gnu++14 -std=c++0x -fexceptions -frtti -MMD -MF ./Release/.deps/Release/obj.target/libsass/src/libsass/src/constants.o.d.raw   -c -o Release/obj.target/libsass/src/libsass/src/constants.o ../src/libsass/src/constants.cpp
npm ERR!   g++ '-DNODE_GYP_MODULE_NAME=libsass' '-DUSING_UV_SHARED=1' '-DUSING_V8_SHARED=1' '-DV8_DEPRECATION_WARNINGS=1' '-DV8_DEPRECATION_WARNINGS' '-DV8_IMMINENT_DEPRECATION_WARNINGS' '-D_GLIBCXX_USE_CXX11_ABI=1' '-D_LARGEFILE_SOURCE' '-D_FILE_OFFSET_BITS=64' '-D__STDC_FORMAT_MACROS' '-DOPENSSL_NO_PINSHARED' '-DOPENSSL_THREADS' '-DLIBSASS_VERSION="3.5.5"' -I/home/komissarov/.node-gyp/16.11.1/include/node -I/home/komissarov/.node-gyp/16.11.1/src -I/home/komissarov/.node-gyp/16.11.1/deps/openssl/config -I/home/komissarov/.node-gyp/16.11.1/deps/openssl/openssl/include -I/home/komissarov/.node-gyp/16.11.1/deps/uv/include -I/home/komissarov/.node-gyp/16.11.1/deps/zlib -I/home/komissarov/.node-gyp/16.11.1/deps/v8/include -I../src/libsass/include  -fPIC -pthread -Wall -Wextra -Wno-unused-parameter -m64 -O3 -fno-omit-frame-pointer -std=gnu++14 -std=c++0x -fexceptions -frtti -MMD -MF ./Release/.deps/Release/obj.target/libsass/src/libsass/src/context.o.d.raw   -c -o Release/obj.target/libsass/src/libsass/src/context.o ../src/libsass/src/context.cpp
npm ERR!   g++ '-DNODE_GYP_MODULE_NAME=libsass' '-DUSING_UV_SHARED=1' '-DUSING_V8_SHARED=1' '-DV8_DEPRECATION_WARNINGS=1' '-DV8_DEPRECATION_WARNINGS' '-DV8_IMMINENT_DEPRECATION_WARNINGS' '-D_GLIBCXX_USE_CXX11_ABI=1' '-D_LARGEFILE_SOURCE' '-D_FILE_OFFSET_BITS=64' '-D__STDC_FORMAT_MACROS' '-DOPENSSL_NO_PINSHARED' '-DOPENSSL_THREADS' '-DLIBSASS_VERSION="3.5.5"' -I/home/komissarov/.node-gyp/16.11.1/include/node -I/home/komissarov/.node-gyp/16.11.1/src -I/home/komissarov/.node-gyp/16.11.1/deps/openssl/config -I/home/komissarov/.node-gyp/16.11.1/deps/openssl/openssl/include -I/home/komissarov/.node-gyp/16.11.1/deps/uv/include -I/home/komissarov/.node-gyp/16.11.1/deps/zlib -I/home/komissarov/.node-gyp/16.11.1/deps/v8/include -I../src/libsass/include  -fPIC -pthread -Wall -Wextra -Wno-unused-parameter -m64 -O3 -fno-omit-frame-pointer -std=gnu++14 -std=c++0x -fexceptions -frtti -MMD -MF ./Release/.deps/Release/obj.target/libsass/src/libsass/src/cssize.o.d.raw   -c -o Release/obj.target/libsass/src/libsass/src/cssize.o ../src/libsass/src/cssize.cpp
npm ERR!   g++ '-DNODE_GYP_MODULE_NAME=libsass' '-DUSING_UV_SHARED=1' '-DUSING_V8_SHARED=1' '-DV8_DEPRECATION_WARNINGS=1' '-DV8_DEPRECATION_WARNINGS' '-DV8_IMMINENT_DEPRECATION_WARNINGS' '-D_GLIBCXX_USE_CXX11_ABI=1' '-D_LARGEFILE_SOURCE' '-D_FILE_OFFSET_BITS=64' '-D__STDC_FORMAT_MACROS' '-DOPENSSL_NO_PINSHARED' '-DOPENSSL_THREADS' '-DLIBSASS_VERSION="3.5.5"' -I/home/komissarov/.node-gyp/16.11.1/include/node -I/home/komissarov/.node-gyp/16.11.1/src -I/home/komissarov/.node-gyp/16.11.1/deps/openssl/config -I/home/komissarov/.node-gyp/16.11.1/deps/openssl/openssl/include -I/home/komissarov/.node-gyp/16.11.1/deps/uv/include -I/home/komissarov/.node-gyp/16.11.1/deps/zlib -I/home/komissarov/.node-gyp/16.11.1/deps/v8/include -I../src/libsass/include  -fPIC -pthread -Wall -Wextra -Wno-unused-parameter -m64 -O3 -fno-omit-frame-pointer -std=gnu++14 -std=c++0x -fexceptions -frtti -MMD -MF ./Release/.deps/Release/obj.target/libsass/src/libsass/src/emitter.o.d.raw   -c -o Release/obj.target/libsass/src/libsass/src/emitter.o ../src/libsass/src/emitter.cpp
npm ERR!   g++ '-DNODE_GYP_MODULE_NAME=libsass' '-DUSING_UV_SHARED=1' '-DUSING_V8_SHARED=1' '-DV8_DEPRECATION_WARNINGS=1' '-DV8_DEPRECATION_WARNINGS' '-DV8_IMMINENT_DEPRECATION_WARNINGS' '-D_GLIBCXX_USE_CXX11_ABI=1' '-D_LARGEFILE_SOURCE' '-D_FILE_OFFSET_BITS=64' '-D__STDC_FORMAT_MACROS' '-DOPENSSL_NO_PINSHARED' '-DOPENSSL_THREADS' '-DLIBSASS_VERSION="3.5.5"' -I/home/komissarov/.node-gyp/16.11.1/include/node -I/home/komissarov/.node-gyp/16.11.1/src -I/home/komissarov/.node-gyp/16.11.1/deps/openssl/config -I/home/komissarov/.node-gyp/16.11.1/deps/openssl/openssl/include -I/home/komissarov/.node-gyp/16.11.1/deps/uv/include -I/home/komissarov/.node-gyp/16.11.1/deps/zlib -I/home/komissarov/.node-gyp/16.11.1/deps/v8/include -I../src/libsass/include  -fPIC -pthread -Wall -Wextra -Wno-unused-parameter -m64 -O3 -fno-omit-frame-pointer -std=gnu++14 -std=c++0x -fexceptions -frtti -MMD -MF ./Release/.deps/Release/obj.target/libsass/src/libsass/src/environment.o.d.raw   -c -o Release/obj.target/libsass/src/libsass/src/environment.o ../src/libsass/src/environment.cpp
npm ERR!   g++ '-DNODE_GYP_MODULE_NAME=libsass' '-DUSING_UV_SHARED=1' '-DUSING_V8_SHARED=1' '-DV8_DEPRECATION_WARNINGS=1' '-DV8_DEPRECATION_WARNINGS' '-DV8_IMMINENT_DEPRECATION_WARNINGS' '-D_GLIBCXX_USE_CXX11_ABI=1' '-D_LARGEFILE_SOURCE' '-D_FILE_OFFSET_BITS=64' '-D__STDC_FORMAT_MACROS' '-DOPENSSL_NO_PINSHARED' '-DOPENSSL_THREADS' '-DLIBSASS_VERSION="3.5.5"' -I/home/komissarov/.node-gyp/16.11.1/include/node -I/home/komissarov/.node-gyp/16.11.1/src -I/home/komissarov/.node-gyp/16.11.1/deps/openssl/config -I/home/komissarov/.node-gyp/16.11.1/deps/openssl/openssl/include -I/home/komissarov/.node-gyp/16.11.1/deps/uv/include -I/home/komissarov/.node-gyp/16.11.1/deps/zlib -I/home/komissarov/.node-gyp/16.11.1/deps/v8/include -I../src/libsass/include  -fPIC -pthread -Wall -Wextra -Wno-unused-parameter -m64 -O3 -fno-omit-frame-pointer -std=gnu++14 -std=c++0x -fexceptions -frtti -MMD -MF ./Release/.deps/Release/obj.target/libsass/src/libsass/src/error_handling.o.d.raw   -c -o Release/obj.target/libsass/src/libsass/src/error_handling.o ../src/libsass/src/error_handling.cpp
npm ERR!   g++ '-DNODE_GYP_MODULE_NAME=libsass' '-DUSING_UV_SHARED=1' '-DUSING_V8_SHARED=1' '-DV8_DEPRECATION_WARNINGS=1' '-DV8_DEPRECATION_WARNINGS' '-DV8_IMMINENT_DEPRECATION_WARNINGS' '-D_GLIBCXX_USE_CXX11_ABI=1' '-D_LARGEFILE_SOURCE' '-D_FILE_OFFSET_BITS=64' '-D__STDC_FORMAT_MACROS' '-DOPENSSL_NO_PINSHARED' '-DOPENSSL_THREADS' '-DLIBSASS_VERSION="3.5.5"' -I/home/komissarov/.node-gyp/16.11.1/include/node -I/home/komissarov/.node-gyp/16.11.1/src -I/home/komissarov/.node-gyp/16.11.1/deps/openssl/config -I/home/komissarov/.node-gyp/16.11.1/deps/openssl/openssl/include -I/home/komissarov/.node-gyp/16.11.1/deps/uv/include -I/home/komissarov/.node-gyp/16.11.1/deps/zlib -I/home/komissarov/.node-gyp/16.11.1/deps/v8/include -I../src/libsass/include  -fPIC -pthread -Wall -Wextra -Wno-unused-parameter -m64 -O3 -fno-omit-frame-pointer -std=gnu++14 -std=c++0x -fexceptions -frtti -MMD -MF ./Release/.deps/Release/obj.target/libsass/src/libsass/src/eval.o.d.raw   -c -o Release/obj.target/libsass/src/libsass/src/eval.o ../src/libsass/src/eval.cpp
npm ERR!   g++ '-DNODE_GYP_MODULE_NAME=libsass' '-DUSING_UV_SHARED=1' '-DUSING_V8_SHARED=1' '-DV8_DEPRECATION_WARNINGS=1' '-DV8_DEPRECATION_WARNINGS' '-DV8_IMMINENT_DEPRECATION_WARNINGS' '-D_GLIBCXX_USE_CXX11_ABI=1' '-D_LARGEFILE_SOURCE' '-D_FILE_OFFSET_BITS=64' '-D__STDC_FORMAT_MACROS' '-DOPENSSL_NO_PINSHARED' '-DOPENSSL_THREADS' '-DLIBSASS_VERSION="3.5.5"' -I/home/komissarov/.node-gyp/16.11.1/include/node -I/home/komissarov/.node-gyp/16.11.1/src -I/home/komissarov/.node-gyp/16.11.1/deps/openssl/config -I/home/komissarov/.node-gyp/16.11.1/deps/openssl/openssl/include -I/home/komissarov/.node-gyp/16.11.1/deps/uv/include -I/home/komissarov/.node-gyp/16.11.1/deps/zlib -I/home/komissarov/.node-gyp/16.11.1/deps/v8/include -I../src/libsass/include  -fPIC -pthread -Wall -Wextra -Wno-unused-parameter -m64 -O3 -fno-omit-frame-pointer -std=gnu++14 -std=c++0x -fexceptions -frtti -MMD -MF ./Release/.deps/Release/obj.target/libsass/src/libsass/src/expand.o.d.raw   -c -o Release/obj.target/libsass/src/libsass/src/expand.o ../src/libsass/src/expand.cpp
npm ERR!   g++ '-DNODE_GYP_MODULE_NAME=libsass' '-DUSING_UV_SHARED=1' '-DUSING_V8_SHARED=1' '-DV8_DEPRECATION_WARNINGS=1' '-DV8_DEPRECATION_WARNINGS' '-DV8_IMMINENT_DEPRECATION_WARNINGS' '-D_GLIBCXX_USE_CXX11_ABI=1' '-D_LARGEFILE_SOURCE' '-D_FILE_OFFSET_BITS=64' '-D__STDC_FORMAT_MACROS' '-DOPENSSL_NO_PINSHARED' '-DOPENSSL_THREADS' '-DLIBSASS_VERSION="3.5.5"' -I/home/komissarov/.node-gyp/16.11.1/include/node -I/home/komissarov/.node-gyp/16.11.1/src -I/home/komissarov/.node-gyp/16.11.1/deps/openssl/config -I/home/komissarov/.node-gyp/16.11.1/deps/openssl/openssl/include -I/home/komissarov/.node-gyp/16.11.1/deps/uv/include -I/home/komissarov/.node-gyp/16.11.1/deps/zlib -I/home/komissarov/.node-gyp/16.11.1/deps/v8/include -I../src/libsass/include  -fPIC -pthread -Wall -Wextra -Wno-unused-parameter -m64 -O3 -fno-omit-frame-pointer -std=gnu++14 -std=c++0x -fexceptions -frtti -MMD -MF ./Release/.deps/Release/obj.target/libsass/src/libsass/src/extend.o.d.raw   -c -o Release/obj.target/libsass/src/libsass/src/extend.o ../src/libsass/src/extend.cpp
npm ERR!   g++ '-DNODE_GYP_MODULE_NAME=libsass' '-DUSING_UV_SHARED=1' '-DUSING_V8_SHARED=1' '-DV8_DEPRECATION_WARNINGS=1' '-DV8_DEPRECATION_WARNINGS' '-DV8_IMMINENT_DEPRECATION_WARNINGS' '-D_GLIBCXX_USE_CXX11_ABI=1' '-D_LARGEFILE_SOURCE' '-D_FILE_OFFSET_BITS=64' '-D__STDC_FORMAT_MACROS' '-DOPENSSL_NO_PINSHARED' '-DOPENSSL_THREADS' '-DLIBSASS_VERSION="3.5.5"' -I/home/komissarov/.node-gyp/16.11.1/include/node -I/home/komissarov/.node-gyp/16.11.1/src -I/home/komissarov/.node-gyp/16.11.1/deps/openssl/config -I/home/komissarov/.node-gyp/16.11.1/deps/openssl/openssl/include -I/home/komissarov/.node-gyp/16.11.1/deps/uv/include -I/home/komissarov/.node-gyp/16.11.1/deps/zlib -I/home/komissarov/.node-gyp/16.11.1/deps/v8/include -I../src/libsass/include  -fPIC -pthread -Wall -Wextra -Wno-unused-parameter -m64 -O3 -fno-omit-frame-pointer -std=gnu++14 -std=c++0x -fexceptions -frtti -MMD -MF ./Release/.deps/Release/obj.target/libsass/src/libsass/src/file.o.d.raw   -c -o Release/obj.target/libsass/src/libsass/src/file.o ../src/libsass/src/file.cpp
npm ERR!   g++ '-DNODE_GYP_MODULE_NAME=libsass' '-DUSING_UV_SHARED=1' '-DUSING_V8_SHARED=1' '-DV8_DEPRECATION_WARNINGS=1' '-DV8_DEPRECATION_WARNINGS' '-DV8_IMMINENT_DEPRECATION_WARNINGS' '-D_GLIBCXX_USE_CXX11_ABI=1' '-D_LARGEFILE_SOURCE' '-D_FILE_OFFSET_BITS=64' '-D__STDC_FORMAT_MACROS' '-DOPENSSL_NO_PINSHARED' '-DOPENSSL_THREADS' '-DLIBSASS_VERSION="3.5.5"' -I/home/komissarov/.node-gyp/16.11.1/include/node -I/home/komissarov/.node-gyp/16.11.1/src -I/home/komissarov/.node-gyp/16.11.1/deps/openssl/config -I/home/komissarov/.node-gyp/16.11.1/deps/openssl/openssl/include -I/home/komissarov/.node-gyp/16.11.1/deps/uv/include -I/home/komissarov/.node-gyp/16.11.1/deps/zlib -I/home/komissarov/.node-gyp/16.11.1/deps/v8/include -I../src/libsass/include  -fPIC -pthread -Wall -Wextra -Wno-unused-parameter -m64 -O3 -fno-omit-frame-pointer -std=gnu++14 -std=c++0x -fexceptions -frtti -MMD -MF ./Release/.deps/Release/obj.target/libsass/src/libsass/src/functions.o.d.raw   -c -o Release/obj.target/libsass/src/libsass/src/functions.o ../src/libsass/src/functions.cpp
npm ERR!   g++ '-DNODE_GYP_MODULE_NAME=libsass' '-DUSING_UV_SHARED=1' '-DUSING_V8_SHARED=1' '-DV8_DEPRECATION_WARNINGS=1' '-DV8_DEPRECATION_WARNINGS' '-DV8_IMMINENT_DEPRECATION_WARNINGS' '-D_GLIBCXX_USE_CXX11_ABI=1' '-D_LARGEFILE_SOURCE' '-D_FILE_OFFSET_BITS=64' '-D__STDC_FORMAT_MACROS' '-DOPENSSL_NO_PINSHARED' '-DOPENSSL_THREADS' '-DLIBSASS_VERSION="3.5.5"' -I/home/komissarov/.node-gyp/16.11.1/include/node -I/home/komissarov/.node-gyp/16.11.1/src -I/home/komissarov/.node-gyp/16.11.1/deps/openssl/config -I/home/komissarov/.node-gyp/16.11.1/deps/openssl/openssl/include -I/home/komissarov/.node-gyp/16.11.1/deps/uv/include -I/home/komissarov/.node-gyp/16.11.1/deps/zlib -I/home/komissarov/.node-gyp/16.11.1/deps/v8/include -I../src/libsass/include  -fPIC -pthread -Wall -Wextra -Wno-unused-parameter -m64 -O3 -fno-omit-frame-pointer -std=gnu++14 -std=c++0x -fexceptions -frtti -MMD -MF ./Release/.deps/Release/obj.target/libsass/src/libsass/src/inspect.o.d.raw   -c -o Release/obj.target/libsass/src/libsass/src/inspect.o ../src/libsass/src/inspect.cpp
npm ERR!   g++ '-DNODE_GYP_MODULE_NAME=libsass' '-DUSING_UV_SHARED=1' '-DUSING_V8_SHARED=1' '-DV8_DEPRECATION_WARNINGS=1' '-DV8_DEPRECATION_WARNINGS' '-DV8_IMMINENT_DEPRECATION_WARNINGS' '-D_GLIBCXX_USE_CXX11_ABI=1' '-D_LARGEFILE_SOURCE' '-D_FILE_OFFSET_BITS=64' '-D__STDC_FORMAT_MACROS' '-DOPENSSL_NO_PINSHARED' '-DOPENSSL_THREADS' '-DLIBSASS_VERSION="3.5.5"' -I/home/komissarov/.node-gyp/16.11.1/include/node -I/home/komissarov/.node-gyp/16.11.1/src -I/home/komissarov/.node-gyp/16.11.1/deps/openssl/config -I/home/komissarov/.node-gyp/16.11.1/deps/openssl/openssl/include -I/home/komissarov/.node-gyp/16.11.1/deps/uv/include -I/home/komissarov/.node-gyp/16.11.1/deps/zlib -I/home/komissarov/.node-gyp/16.11.1/deps/v8/include -I../src/libsass/include  -fPIC -pthread -Wall -Wextra -Wno-unused-parameter -m64 -O3 -fno-omit-frame-pointer -std=gnu++14 -std=c++0x -fexceptions -frtti -MMD -MF ./Release/.deps/Release/obj.target/libsass/src/libsass/src/json.o.d.raw   -c -o Release/obj.target/libsass/src/libsass/src/json.o ../src/libsass/src/json.cpp
npm ERR!   g++ '-DNODE_GYP_MODULE_NAME=libsass' '-DUSING_UV_SHARED=1' '-DUSING_V8_SHARED=1' '-DV8_DEPRECATION_WARNINGS=1' '-DV8_DEPRECATION_WARNINGS' '-DV8_IMMINENT_DEPRECATION_WARNINGS' '-D_GLIBCXX_USE_CXX11_ABI=1' '-D_LARGEFILE_SOURCE' '-D_FILE_OFFSET_BITS=64' '-D__STDC_FORMAT_MACROS' '-DOPENSSL_NO_PINSHARED' '-DOPENSSL_THREADS' '-DLIBSASS_VERSION="3.5.5"' -I/home/komissarov/.node-gyp/16.11.1/include/node -I/home/komissarov/.node-gyp/16.11.1/src -I/home/komissarov/.node-gyp/16.11.1/deps/openssl/config -I/home/komissarov/.node-gyp/16.11.1/deps/openssl/openssl/include -I/home/komissarov/.node-gyp/16.11.1/deps/uv/include -I/home/komissarov/.node-gyp/16.11.1/deps/zlib -I/home/komissarov/.node-gyp/16.11.1/deps/v8/include -I../src/libsass/include  -fPIC -pthread -Wall -Wextra -Wno-unused-parameter -m64 -O3 -fno-omit-frame-pointer -std=gnu++14 -std=c++0x -fexceptions -frtti -MMD -MF ./Release/.deps/Release/obj.target/libsass/src/libsass/src/lexer.o.d.raw   -c -o Release/obj.target/libsass/src/libsass/src/lexer.o ../src/libsass/src/lexer.cpp
npm ERR!   g++ '-DNODE_GYP_MODULE_NAME=libsass' '-DUSING_UV_SHARED=1' '-DUSING_V8_SHARED=1' '-DV8_DEPRECATION_WARNINGS=1' '-DV8_DEPRECATION_WARNINGS' '-DV8_IMMINENT_DEPRECATION_WARNINGS' '-D_GLIBCXX_USE_CXX11_ABI=1' '-D_LARGEFILE_SOURCE' '-D_FILE_OFFSET_BITS=64' '-D__STDC_FORMAT_MACROS' '-DOPENSSL_NO_PINSHARED' '-DOPENSSL_THREADS' '-DLIBSASS_VERSION="3.5.5"' -I/home/komissarov/.node-gyp/16.11.1/include/node -I/home/komissarov/.node-gyp/16.11.1/src -I/home/komissarov/.node-gyp/16.11.1/deps/openssl/config -I/home/komissarov/.node-gyp/16.11.1/deps/openssl/openssl/include -I/home/komissarov/.node-gyp/16.11.1/deps/uv/include -I/home/komissarov/.node-gyp/16.11.1/deps/zlib -I/home/komissarov/.node-gyp/16.11.1/deps/v8/include -I../src/libsass/include  -fPIC -pthread -Wall -Wextra -Wno-unused-parameter -m64 -O3 -fno-omit-frame-pointer -std=gnu++14 -std=c++0x -fexceptions -frtti -MMD -MF ./Release/.deps/Release/obj.target/libsass/src/libsass/src/listize.o.d.raw   -c -o Release/obj.target/libsass/src/libsass/src/listize.o ../src/libsass/src/listize.cpp
npm ERR!   g++ '-DNODE_GYP_MODULE_NAME=libsass' '-DUSING_UV_SHARED=1' '-DUSING_V8_SHARED=1' '-DV8_DEPRECATION_WARNINGS=1' '-DV8_DEPRECATION_WARNINGS' '-DV8_IMMINENT_DEPRECATION_WARNINGS' '-D_GLIBCXX_USE_CXX11_ABI=1' '-D_LARGEFILE_SOURCE' '-D_FILE_OFFSET_BITS=64' '-D__STDC_FORMAT_MACROS' '-DOPENSSL_NO_PINSHARED' '-DOPENSSL_THREADS' '-DLIBSASS_VERSION="3.5.5"' -I/home/komissarov/.node-gyp/16.11.1/include/node -I/home/komissarov/.node-gyp/16.11.1/src -I/home/komissarov/.node-gyp/16.11.1/deps/openssl/config -I/home/komissarov/.node-gyp/16.11.1/deps/openssl/openssl/include -I/home/komissarov/.node-gyp/16.11.1/deps/uv/include -I/home/komissarov/.node-gyp/16.11.1/deps/zlib -I/home/komissarov/.node-gyp/16.11.1/deps/v8/include -I../src/libsass/include  -fPIC -pthread -Wall -Wextra -Wno-unused-parameter -m64 -O3 -fno-omit-frame-pointer -std=gnu++14 -std=c++0x -fexceptions -frtti -MMD -MF ./Release/.deps/Release/obj.target/libsass/src/libsass/src/memory/SharedPtr.o.d.raw   -c -o Release/obj.target/libsass/src/libsass/src/memory/SharedPtr.o ../src/libsass/src/memory/SharedPtr.cpp
npm ERR!   g++ '-DNODE_GYP_MODULE_NAME=libsass' '-DUSING_UV_SHARED=1' '-DUSING_V8_SHARED=1' '-DV8_DEPRECATION_WARNINGS=1' '-DV8_DEPRECATION_WARNINGS' '-DV8_IMMINENT_DEPRECATION_WARNINGS' '-D_GLIBCXX_USE_CXX11_ABI=1' '-D_LARGEFILE_SOURCE' '-D_FILE_OFFSET_BITS=64' '-D__STDC_FORMAT_MACROS' '-DOPENSSL_NO_PINSHARED' '-DOPENSSL_THREADS' '-DLIBSASS_VERSION="3.5.5"' -I/home/komissarov/.node-gyp/16.11.1/include/node -I/home/komissarov/.node-gyp/16.11.1/src -I/home/komissarov/.node-gyp/16.11.1/deps/openssl/config -I/home/komissarov/.node-gyp/16.11.1/deps/openssl/openssl/include -I/home/komissarov/.node-gyp/16.11.1/deps/uv/include -I/home/komissarov/.node-gyp/16.11.1/deps/zlib -I/home/komissarov/.node-gyp/16.11.1/deps/v8/include -I../src/libsass/include  -fPIC -pthread -Wall -Wextra -Wno-unused-parameter -m64 -O3 -fno-omit-frame-pointer -std=gnu++14 -std=c++0x -fexceptions -frtti -MMD -MF ./Release/.deps/Release/obj.target/libsass/src/libsass/src/node.o.d.raw   -c -o Release/obj.target/libsass/src/libsass/src/node.o ../src/libsass/src/node.cpp
npm ERR!   g++ '-DNODE_GYP_MODULE_NAME=libsass' '-DUSING_UV_SHARED=1' '-DUSING_V8_SHARED=1' '-DV8_DEPRECATION_WARNINGS=1' '-DV8_DEPRECATION_WARNINGS' '-DV8_IMMINENT_DEPRECATION_WARNINGS' '-D_GLIBCXX_USE_CXX11_ABI=1' '-D_LARGEFILE_SOURCE' '-D_FILE_OFFSET_BITS=64' '-D__STDC_FORMAT_MACROS' '-DOPENSSL_NO_PINSHARED' '-DOPENSSL_THREADS' '-DLIBSASS_VERSION="3.5.5"' -I/home/komissarov/.node-gyp/16.11.1/include/node -I/home/komissarov/.node-gyp/16.11.1/src -I/home/komissarov/.node-gyp/16.11.1/deps/openssl/config -I/home/komissarov/.node-gyp/16.11.1/deps/openssl/openssl/include -I/home/komissarov/.node-gyp/16.11.1/deps/uv/include -I/home/komissarov/.node-gyp/16.11.1/deps/zlib -I/home/komissarov/.node-gyp/16.11.1/deps/v8/include -I../src/libsass/include  -fPIC -pthread -Wall -Wextra -Wno-unused-parameter -m64 -O3 -fno-omit-frame-pointer -std=gnu++14 -std=c++0x -fexceptions -frtti -MMD -MF ./Release/.deps/Release/obj.target/libsass/src/libsass/src/operators.o.d.raw   -c -o Release/obj.target/libsass/src/libsass/src/operators.o ../src/libsass/src/operators.cpp
npm ERR!   g++ '-DNODE_GYP_MODULE_NAME=libsass' '-DUSING_UV_SHARED=1' '-DUSING_V8_SHARED=1' '-DV8_DEPRECATION_WARNINGS=1' '-DV8_DEPRECATION_WARNINGS' '-DV8_IMMINENT_DEPRECATION_WARNINGS' '-D_GLIBCXX_USE_CXX11_ABI=1' '-D_LARGEFILE_SOURCE' '-D_FILE_OFFSET_BITS=64' '-D__STDC_FORMAT_MACROS' '-DOPENSSL_NO_PINSHARED' '-DOPENSSL_THREADS' '-DLIBSASS_VERSION="3.5.5"' -I/home/komissarov/.node-gyp/16.11.1/include/node -I/home/komissarov/.node-gyp/16.11.1/src -I/home/komissarov/.node-gyp/16.11.1/deps/openssl/config -I/home/komissarov/.node-gyp/16.11.1/deps/openssl/openssl/include -I/home/komissarov/.node-gyp/16.11.1/deps/uv/include -I/home/komissarov/.node-gyp/16.11.1/deps/zlib -I/home/komissarov/.node-gyp/16.11.1/deps/v8/include -I../src/libsass/include  -fPIC -pthread -Wall -Wextra -Wno-unused-parameter -m64 -O3 -fno-omit-frame-pointer -std=gnu++14 -std=c++0x -fexceptions -frtti -MMD -MF ./Release/.deps/Release/obj.target/libsass/src/libsass/src/output.o.d.raw   -c -o Release/obj.target/libsass/src/libsass/src/output.o ../src/libsass/src/output.cpp
npm ERR!   g++ '-DNODE_GYP_MODULE_NAME=libsass' '-DUSING_UV_SHARED=1' '-DUSING_V8_SHARED=1' '-DV8_DEPRECATION_WARNINGS=1' '-DV8_DEPRECATION_WARNINGS' '-DV8_IMMINENT_DEPRECATION_WARNINGS' '-D_GLIBCXX_USE_CXX11_ABI=1' '-D_LARGEFILE_SOURCE' '-D_FILE_OFFSET_BITS=64' '-D__STDC_FORMAT_MACROS' '-DOPENSSL_NO_PINSHARED' '-DOPENSSL_THREADS' '-DLIBSASS_VERSION="3.5.5"' -I/home/komissarov/.node-gyp/16.11.1/include/node -I/home/komissarov/.node-gyp/16.11.1/src -I/home/komissarov/.node-gyp/16.11.1/deps/openssl/config -I/home/komissarov/.node-gyp/16.11.1/deps/openssl/openssl/include -I/home/komissarov/.node-gyp/16.11.1/deps/uv/include -I/home/komissarov/.node-gyp/16.11.1/deps/zlib -I/home/komissarov/.node-gyp/16.11.1/deps/v8/include -I../src/libsass/include  -fPIC -pthread -Wall -Wextra -Wno-unused-parameter -m64 -O3 -fno-omit-frame-pointer -std=gnu++14 -std=c++0x -fexceptions -frtti -MMD -MF ./Release/.deps/Release/obj.target/libsass/src/libsass/src/parser.o.d.raw   -c -o Release/obj.target/libsass/src/libsass/src/parser.o ../src/libsass/src/parser.cpp
npm ERR!   g++ '-DNODE_GYP_MODULE_NAME=libsass' '-DUSING_UV_SHARED=1' '-DUSING_V8_SHARED=1' '-DV8_DEPRECATION_WARNINGS=1' '-DV8_DEPRECATION_WARNINGS' '-DV8_IMMINENT_DEPRECATION_WARNINGS' '-D_GLIBCXX_USE_CXX11_ABI=1' '-D_LARGEFILE_SOURCE' '-D_FILE_OFFSET_BITS=64' '-D__STDC_FORMAT_MACROS' '-DOPENSSL_NO_PINSHARED' '-DOPENSSL_THREADS' '-DLIBSASS_VERSION="3.5.5"' -I/home/komissarov/.node-gyp/16.11.1/include/node -I/home/komissarov/.node-gyp/16.11.1/src -I/home/komissarov/.node-gyp/16.11.1/deps/openssl/config -I/home/komissarov/.node-gyp/16.11.1/deps/openssl/openssl/include -I/home/komissarov/.node-gyp/16.11.1/deps/uv/include -I/home/komissarov/.node-gyp/16.11.1/deps/zlib -I/home/komissarov/.node-gyp/16.11.1/deps/v8/include -I../src/libsass/include  -fPIC -pthread -Wall -Wextra -Wno-unused-parameter -m64 -O3 -fno-omit-frame-pointer -std=gnu++14 -std=c++0x -fexceptions -frtti -MMD -MF ./Release/.deps/Release/obj.target/libsass/src/libsass/src/plugins.o.d.raw   -c -o Release/obj.target/libsass/src/libsass/src/plugins.o ../src/libsass/src/plugins.cpp
npm ERR!   g++ '-DNODE_GYP_MODULE_NAME=libsass' '-DUSING_UV_SHARED=1' '-DUSING_V8_SHARED=1' '-DV8_DEPRECATION_WARNINGS=1' '-DV8_DEPRECATION_WARNINGS' '-DV8_IMMINENT_DEPRECATION_WARNINGS' '-D_GLIBCXX_USE_CXX11_ABI=1' '-D_LARGEFILE_SOURCE' '-D_FILE_OFFSET_BITS=64' '-D__STDC_FORMAT_MACROS' '-DOPENSSL_NO_PINSHARED' '-DOPENSSL_THREADS' '-DLIBSASS_VERSION="3.5.5"' -I/home/komissarov/.node-gyp/16.11.1/include/node -I/home/komissarov/.node-gyp/16.11.1/src -I/home/komissarov/.node-gyp/16.11.1/deps/openssl/config -I/home/komissarov/.node-gyp/16.11.1/deps/openssl/openssl/include -I/home/komissarov/.node-gyp/16.11.1/deps/uv/include -I/home/komissarov/.node-gyp/16.11.1/deps/zlib -I/home/komissarov/.node-gyp/16.11.1/deps/v8/include -I../src/libsass/include  -fPIC -pthread -Wall -Wextra -Wno-unused-parameter -m64 -O3 -fno-omit-frame-pointer -std=gnu++14 -std=c++0x -fexceptions -frtti -MMD -MF ./Release/.deps/Release/obj.target/libsass/src/libsass/src/position.o.d.raw   -c -o Release/obj.target/libsass/src/libsass/src/position.o ../src/libsass/src/position.cpp
npm ERR!   g++ '-DNODE_GYP_MODULE_NAME=libsass' '-DUSING_UV_SHARED=1' '-DUSING_V8_SHARED=1' '-DV8_DEPRECATION_WARNINGS=1' '-DV8_DEPRECATION_WARNINGS' '-DV8_IMMINENT_DEPRECATION_WARNINGS' '-D_GLIBCXX_USE_CXX11_ABI=1' '-D_LARGEFILE_SOURCE' '-D_FILE_OFFSET_BITS=64' '-D__STDC_FORMAT_MACROS' '-DOPENSSL_NO_PINSHARED' '-DOPENSSL_THREADS' '-DLIBSASS_VERSION="3.5.5"' -I/home/komissarov/.node-gyp/16.11.1/include/node -I/home/komissarov/.node-gyp/16.11.1/src -I/home/komissarov/.node-gyp/16.11.1/deps/openssl/config -I/home/komissarov/.node-gyp/16.11.1/deps/openssl/openssl/include -I/home/komissarov/.node-gyp/16.11.1/deps/uv/include -I/home/komissarov/.node-gyp/16.11.1/deps/zlib -I/home/komissarov/.node-gyp/16.11.1/deps/v8/include -I../src/libsass/include  -fPIC -pthread -Wall -Wextra -Wno-unused-parameter -m64 -O3 -fno-omit-frame-pointer -std=gnu++14 -std=c++0x -fexceptions -frtti -MMD -MF ./Release/.deps/Release/obj.target/libsass/src/libsass/src/prelexer.o.d.raw   -c -o Release/obj.target/libsass/src/libsass/src/prelexer.o ../src/libsass/src/prelexer.cpp
npm ERR!   g++ '-DNODE_GYP_MODULE_NAME=libsass' '-DUSING_UV_SHARED=1' '-DUSING_V8_SHARED=1' '-DV8_DEPRECATION_WARNINGS=1' '-DV8_DEPRECATION_WARNINGS' '-DV8_IMMINENT_DEPRECATION_WARNINGS' '-D_GLIBCXX_USE_CXX11_ABI=1' '-D_LARGEFILE_SOURCE' '-D_FILE_OFFSET_BITS=64' '-D__STDC_FORMAT_MACROS' '-DOPENSSL_NO_PINSHARED' '-DOPENSSL_THREADS' '-DLIBSASS_VERSION="3.5.5"' -I/home/komissarov/.node-gyp/16.11.1/include/node -I/home/komissarov/.node-gyp/16.11.1/src -I/home/komissarov/.node-gyp/16.11.1/deps/openssl/config -I/home/komissarov/.node-gyp/16.11.1/deps/openssl/openssl/include -I/home/komissarov/.node-gyp/16.11.1/deps/uv/include -I/home/komissarov/.node-gyp/16.11.1/deps/zlib -I/home/komissarov/.node-gyp/16.11.1/deps/v8/include -I../src/libsass/include  -fPIC -pthread -Wall -Wextra -Wno-unused-parameter -m64 -O3 -fno-omit-frame-pointer -std=gnu++14 -std=c++0x -fexceptions -frtti -MMD -MF ./Release/.deps/Release/obj.target/libsass/src/libsass/src/remove_placeholders.o.d.raw   -c -o Release/obj.target/libsass/src/libsass/src/remove_placeholders.o ../src/libsass/src/remove_placeholders.cpp
npm ERR!   g++ '-DNODE_GYP_MODULE_NAME=libsass' '-DUSING_UV_SHARED=1' '-DUSING_V8_SHARED=1' '-DV8_DEPRECATION_WARNINGS=1' '-DV8_DEPRECATION_WARNINGS' '-DV8_IMMINENT_DEPRECATION_WARNINGS' '-D_GLIBCXX_USE_CXX11_ABI=1' '-D_LARGEFILE_SOURCE' '-D_FILE_OFFSET_BITS=64' '-D__STDC_FORMAT_MACROS' '-DOPENSSL_NO_PINSHARED' '-DOPENSSL_THREADS' '-DLIBSASS_VERSION="3.5.5"' -I/home/komissarov/.node-gyp/16.11.1/include/node -I/home/komissarov/.node-gyp/16.11.1/src -I/home/komissarov/.node-gyp/16.11.1/deps/openssl/config -I/home/komissarov/.node-gyp/16.11.1/deps/openssl/openssl/include -I/home/komissarov/.node-gyp/16.11.1/deps/uv/include -I/home/komissarov/.node-gyp/16.11.1/deps/zlib -I/home/komissarov/.node-gyp/16.11.1/deps/v8/include -I../src/libsass/include  -fPIC -pthread -Wall -Wextra -Wno-unused-parameter -m64 -O3 -fno-omit-frame-pointer -std=gnu++14 -std=c++0x -fexceptions -frtti -MMD -MF ./Release/.deps/Release/obj.target/libsass/src/libsass/src/sass.o.d.raw   -c -o Release/obj.target/libsass/src/libsass/src/sass.o ../src/libsass/src/sass.cpp
npm ERR!   g++ '-DNODE_GYP_MODULE_NAME=libsass' '-DUSING_UV_SHARED=1' '-DUSING_V8_SHARED=1' '-DV8_DEPRECATION_WARNINGS=1' '-DV8_DEPRECATION_WARNINGS' '-DV8_IMMINENT_DEPRECATION_WARNINGS' '-D_GLIBCXX_USE_CXX11_ABI=1' '-D_LARGEFILE_SOURCE' '-D_FILE_OFFSET_BITS=64' '-D__STDC_FORMAT_MACROS' '-DOPENSSL_NO_PINSHARED' '-DOPENSSL_THREADS' '-DLIBSASS_VERSION="3.5.5"' -I/home/komissarov/.node-gyp/16.11.1/include/node -I/home/komissarov/.node-gyp/16.11.1/src -I/home/komissarov/.node-gyp/16.11.1/deps/openssl/config -I/home/komissarov/.node-gyp/16.11.1/deps/openssl/openssl/include -I/home/komissarov/.node-gyp/16.11.1/deps/uv/include -I/home/komissarov/.node-gyp/16.11.1/deps/zlib -I/home/komissarov/.node-gyp/16.11.1/deps/v8/include -I../src/libsass/include  -fPIC -pthread -Wall -Wextra -Wno-unused-parameter -m64 -O3 -fno-omit-frame-pointer -std=gnu++14 -std=c++0x -fexceptions -frtti -MMD -MF ./Release/.deps/Release/obj.target/libsass/src/libsass/src/sass2scss.o.d.raw   -c -o Release/obj.target/libsass/src/libsass/src/sass2scss.o ../src/libsass/src/sass2scss.cpp
npm ERR!   g++ '-DNODE_GYP_MODULE_NAME=libsass' '-DUSING_UV_SHARED=1' '-DUSING_V8_SHARED=1' '-DV8_DEPRECATION_WARNINGS=1' '-DV8_DEPRECATION_WARNINGS' '-DV8_IMMINENT_DEPRECATION_WARNINGS' '-D_GLIBCXX_USE_CXX11_ABI=1' '-D_LARGEFILE_SOURCE' '-D_FILE_OFFSET_BITS=64' '-D__STDC_FORMAT_MACROS' '-DOPENSSL_NO_PINSHARED' '-DOPENSSL_THREADS' '-DLIBSASS_VERSION="3.5.5"' -I/home/komissarov/.node-gyp/16.11.1/include/node -I/home/komissarov/.node-gyp/16.11.1/src -I/home/komissarov/.node-gyp/16.11.1/deps/openssl/config -I/home/komissarov/.node-gyp/16.11.1/deps/openssl/openssl/include -I/home/komissarov/.node-gyp/16.11.1/deps/uv/include -I/home/komissarov/.node-gyp/16.11.1/deps/zlib -I/home/komissarov/.node-gyp/16.11.1/deps/v8/include -I../src/libsass/include  -fPIC -pthread -Wall -Wextra -Wno-unused-parameter -m64 -O3 -fno-omit-frame-pointer -std=gnu++14 -std=c++0x -fexceptions -frtti -MMD -MF ./Release/.deps/Release/obj.target/libsass/src/libsass/src/sass_context.o.d.raw   -c -o Release/obj.target/libsass/src/libsass/src/sass_context.o ../src/libsass/src/sass_context.cpp
npm ERR!   g++ '-DNODE_GYP_MODULE_NAME=libsass' '-DUSING_UV_SHARED=1' '-DUSING_V8_SHARED=1' '-DV8_DEPRECATION_WARNINGS=1' '-DV8_DEPRECATION_WARNINGS' '-DV8_IMMINENT_DEPRECATION_WARNINGS' '-D_GLIBCXX_USE_CXX11_ABI=1' '-D_LARGEFILE_SOURCE' '-D_FILE_OFFSET_BITS=64' '-D__STDC_FORMAT_MACROS' '-DOPENSSL_NO_PINSHARED' '-DOPENSSL_THREADS' '-DLIBSASS_VERSION="3.5.5"' -I/home/komissarov/.node-gyp/16.11.1/include/node -I/home/komissarov/.node-gyp/16.11.1/src -I/home/komissarov/.node-gyp/16.11.1/deps/openssl/config -I/home/komissarov/.node-gyp/16.11.1/deps/openssl/openssl/include -I/home/komissarov/.node-gyp/16.11.1/deps/uv/include -I/home/komissarov/.node-gyp/16.11.1/deps/zlib -I/home/komissarov/.node-gyp/16.11.1/deps/v8/include -I../src/libsass/include  -fPIC -pthread -Wall -Wextra -Wno-unused-parameter -m64 -O3 -fno-omit-frame-pointer -std=gnu++14 -std=c++0x -fexceptions -frtti -MMD -MF ./Release/.deps/Release/obj.target/libsass/src/libsass/src/sass_functions.o.d.raw   -c -o Release/obj.target/libsass/src/libsass/src/sass_functions.o ../src/libsass/src/sass_functions.cpp
npm ERR!   g++ '-DNODE_GYP_MODULE_NAME=libsass' '-DUSING_UV_SHARED=1' '-DUSING_V8_SHARED=1' '-DV8_DEPRECATION_WARNINGS=1' '-DV8_DEPRECATION_WARNINGS' '-DV8_IMMINENT_DEPRECATION_WARNINGS' '-D_GLIBCXX_USE_CXX11_ABI=1' '-D_LARGEFILE_SOURCE' '-D_FILE_OFFSET_BITS=64' '-D__STDC_FORMAT_MACROS' '-DOPENSSL_NO_PINSHARED' '-DOPENSSL_THREADS' '-DLIBSASS_VERSION="3.5.5"' -I/home/komissarov/.node-gyp/16.11.1/include/node -I/home/komissarov/.node-gyp/16.11.1/src -I/home/komissarov/.node-gyp/16.11.1/deps/openssl/config -I/home/komissarov/.node-gyp/16.11.1/deps/openssl/openssl/include -I/home/komissarov/.node-gyp/16.11.1/deps/uv/include -I/home/komissarov/.node-gyp/16.11.1/deps/zlib -I/home/komissarov/.node-gyp/16.11.1/deps/v8/include -I../src/libsass/include  -fPIC -pthread -Wall -Wextra -Wno-unused-parameter -m64 -O3 -fno-omit-frame-pointer -std=gnu++14 -std=c++0x -fexceptions -frtti -MMD -MF ./Release/.deps/Release/obj.target/libsass/src/libsass/src/sass_util.o.d.raw   -c -o Release/obj.target/libsass/src/libsass/src/sass_util.o ../src/libsass/src/sass_util.cpp
npm ERR!   g++ '-DNODE_GYP_MODULE_NAME=libsass' '-DUSING_UV_SHARED=1' '-DUSING_V8_SHARED=1' '-DV8_DEPRECATION_WARNINGS=1' '-DV8_DEPRECATION_WARNINGS' '-DV8_IMMINENT_DEPRECATION_WARNINGS' '-D_GLIBCXX_USE_CXX11_ABI=1' '-D_LARGEFILE_SOURCE' '-D_FILE_OFFSET_BITS=64' '-D__STDC_FORMAT_MACROS' '-DOPENSSL_NO_PINSHARED' '-DOPENSSL_THREADS' '-DLIBSASS_VERSION="3.5.5"' -I/home/komissarov/.node-gyp/16.11.1/include/node -I/home/komissarov/.node-gyp/16.11.1/src -I/home/komissarov/.node-gyp/16.11.1/deps/openssl/config -I/home/komissarov/.node-gyp/16.11.1/deps/openssl/openssl/include -I/home/komissarov/.node-gyp/16.11.1/deps/uv/include -I/home/komissarov/.node-gyp/16.11.1/deps/zlib -I/home/komissarov/.node-gyp/16.11.1/deps/v8/include -I../src/libsass/include  -fPIC -pthread -Wall -Wextra -Wno-unused-parameter -m64 -O3 -fno-omit-frame-pointer -std=gnu++14 -std=c++0x -fexceptions -frtti -MMD -MF ./Release/.deps/Release/obj.target/libsass/src/libsass/src/sass_values.o.d.raw   -c -o Release/obj.target/libsass/src/libsass/src/sass_values.o ../src/libsass/src/sass_values.cpp
npm ERR!   g++ '-DNODE_GYP_MODULE_NAME=libsass' '-DUSING_UV_SHARED=1' '-DUSING_V8_SHARED=1' '-DV8_DEPRECATION_WARNINGS=1' '-DV8_DEPRECATION_WARNINGS' '-DV8_IMMINENT_DEPRECATION_WARNINGS' '-D_GLIBCXX_USE_CXX11_ABI=1' '-D_LARGEFILE_SOURCE' '-D_FILE_OFFSET_BITS=64' '-D__STDC_FORMAT_MACROS' '-DOPENSSL_NO_PINSHARED' '-DOPENSSL_THREADS' '-DLIBSASS_VERSION="3.5.5"' -I/home/komissarov/.node-gyp/16.11.1/include/node -I/home/komissarov/.node-gyp/16.11.1/src -I/home/komissarov/.node-gyp/16.11.1/deps/openssl/config -I/home/komissarov/.node-gyp/16.11.1/deps/openssl/openssl/include -I/home/komissarov/.node-gyp/16.11.1/deps/uv/include -I/home/komissarov/.node-gyp/16.11.1/deps/zlib -I/home/komissarov/.node-gyp/16.11.1/deps/v8/include -I../src/libsass/include  -fPIC -pthread -Wall -Wextra -Wno-unused-parameter -m64 -O3 -fno-omit-frame-pointer -std=gnu++14 -std=c++0x -fexceptions -frtti -MMD -MF ./Release/.deps/Release/obj.target/libsass/src/libsass/src/source_map.o.d.raw   -c -o Release/obj.target/libsass/src/libsass/src/source_map.o ../src/libsass/src/source_map.cpp
npm ERR!   g++ '-DNODE_GYP_MODULE_NAME=libsass' '-DUSING_UV_SHARED=1' '-DUSING_V8_SHARED=1' '-DV8_DEPRECATION_WARNINGS=1' '-DV8_DEPRECATION_WARNINGS' '-DV8_IMMINENT_DEPRECATION_WARNINGS' '-D_GLIBCXX_USE_CXX11_ABI=1' '-D_LARGEFILE_SOURCE' '-D_FILE_OFFSET_BITS=64' '-D__STDC_FORMAT_MACROS' '-DOPENSSL_NO_PINSHARED' '-DOPENSSL_THREADS' '-DLIBSASS_VERSION="3.5.5"' -I/home/komissarov/.node-gyp/16.11.1/include/node -I/home/komissarov/.node-gyp/16.11.1/src -I/home/komissarov/.node-gyp/16.11.1/deps/openssl/config -I/home/komissarov/.node-gyp/16.11.1/deps/openssl/openssl/include -I/home/komissarov/.node-gyp/16.11.1/deps/uv/include -I/home/komissarov/.node-gyp/16.11.1/deps/zlib -I/home/komissarov/.node-gyp/16.11.1/deps/v8/include -I../src/libsass/include  -fPIC -pthread -Wall -Wextra -Wno-unused-parameter -m64 -O3 -fno-omit-frame-pointer -std=gnu++14 -std=c++0x -fexceptions -frtti -MMD -MF ./Release/.deps/Release/obj.target/libsass/src/libsass/src/subset_map.o.d.raw   -c -o Release/obj.target/libsass/src/libsass/src/subset_map.o ../src/libsass/src/subset_map.cpp
npm ERR!   g++ '-DNODE_GYP_MODULE_NAME=libsass' '-DUSING_UV_SHARED=1' '-DUSING_V8_SHARED=1' '-DV8_DEPRECATION_WARNINGS=1' '-DV8_DEPRECATION_WARNINGS' '-DV8_IMMINENT_DEPRECATION_WARNINGS' '-D_GLIBCXX_USE_CXX11_ABI=1' '-D_LARGEFILE_SOURCE' '-D_FILE_OFFSET_BITS=64' '-D__STDC_FORMAT_MACROS' '-DOPENSSL_NO_PINSHARED' '-DOPENSSL_THREADS' '-DLIBSASS_VERSION="3.5.5"' -I/home/komissarov/.node-gyp/16.11.1/include/node -I/home/komissarov/.node-gyp/16.11.1/src -I/home/komissarov/.node-gyp/16.11.1/deps/openssl/config -I/home/komissarov/.node-gyp/16.11.1/deps/openssl/openssl/include -I/home/komissarov/.node-gyp/16.11.1/deps/uv/include -I/home/komissarov/.node-gyp/16.11.1/deps/zlib -I/home/komissarov/.node-gyp/16.11.1/deps/v8/include -I../src/libsass/include  -fPIC -pthread -Wall -Wextra -Wno-unused-parameter -m64 -O3 -fno-omit-frame-pointer -std=gnu++14 -std=c++0x -fexceptions -frtti -MMD -MF ./Release/.deps/Release/obj.target/libsass/src/libsass/src/to_c.o.d.raw   -c -o Release/obj.target/libsass/src/libsass/src/to_c.o ../src/libsass/src/to_c.cpp
npm ERR!   g++ '-DNODE_GYP_MODULE_NAME=libsass' '-DUSING_UV_SHARED=1' '-DUSING_V8_SHARED=1' '-DV8_DEPRECATION_WARNINGS=1' '-DV8_DEPRECATION_WARNINGS' '-DV8_IMMINENT_DEPRECATION_WARNINGS' '-D_GLIBCXX_USE_CXX11_ABI=1' '-D_LARGEFILE_SOURCE' '-D_FILE_OFFSET_BITS=64' '-D__STDC_FORMAT_MACROS' '-DOPENSSL_NO_PINSHARED' '-DOPENSSL_THREADS' '-DLIBSASS_VERSION="3.5.5"' -I/home/komissarov/.node-gyp/16.11.1/include/node -I/home/komissarov/.node-gyp/16.11.1/src -I/home/komissarov/.node-gyp/16.11.1/deps/openssl/config -I/home/komissarov/.node-gyp/16.11.1/deps/openssl/openssl/include -I/home/komissarov/.node-gyp/16.11.1/deps/uv/include -I/home/komissarov/.node-gyp/16.11.1/deps/zlib -I/home/komissarov/.node-gyp/16.11.1/deps/v8/include -I../src/libsass/include  -fPIC -pthread -Wall -Wextra -Wno-unused-parameter -m64 -O3 -fno-omit-frame-pointer -std=gnu++14 -std=c++0x -fexceptions -frtti -MMD -MF ./Release/.deps/Release/obj.target/libsass/src/libsass/src/to_value.o.d.raw   -c -o Release/obj.target/libsass/src/libsass/src/to_value.o ../src/libsass/src/to_value.cpp
npm ERR!   g++ '-DNODE_GYP_MODULE_NAME=libsass' '-DUSING_UV_SHARED=1' '-DUSING_V8_SHARED=1' '-DV8_DEPRECATION_WARNINGS=1' '-DV8_DEPRECATION_WARNINGS' '-DV8_IMMINENT_DEPRECATION_WARNINGS' '-D_GLIBCXX_USE_CXX11_ABI=1' '-D_LARGEFILE_SOURCE' '-D_FILE_OFFSET_BITS=64' '-D__STDC_FORMAT_MACROS' '-DOPENSSL_NO_PINSHARED' '-DOPENSSL_THREADS' '-DLIBSASS_VERSION="3.5.5"' -I/home/komissarov/.node-gyp/16.11.1/include/node -I/home/komissarov/.node-gyp/16.11.1/src -I/home/komissarov/.node-gyp/16.11.1/deps/openssl/config -I/home/komissarov/.node-gyp/16.11.1/deps/openssl/openssl/include -I/home/komissarov/.node-gyp/16.11.1/deps/uv/include -I/home/komissarov/.node-gyp/16.11.1/deps/zlib -I/home/komissarov/.node-gyp/16.11.1/deps/v8/include -I../src/libsass/include  -fPIC -pthread -Wall -Wextra -Wno-unused-parameter -m64 -O3 -fno-omit-frame-pointer -std=gnu++14 -std=c++0x -fexceptions -frtti -MMD -MF ./Release/.deps/Release/obj.target/libsass/src/libsass/src/units.o.d.raw   -c -o Release/obj.target/libsass/src/libsass/src/units.o ../src/libsass/src/units.cpp
npm ERR!   g++ '-DNODE_GYP_MODULE_NAME=libsass' '-DUSING_UV_SHARED=1' '-DUSING_V8_SHARED=1' '-DV8_DEPRECATION_WARNINGS=1' '-DV8_DEPRECATION_WARNINGS' '-DV8_IMMINENT_DEPRECATION_WARNINGS' '-D_GLIBCXX_USE_CXX11_ABI=1' '-D_LARGEFILE_SOURCE' '-D_FILE_OFFSET_BITS=64' '-D__STDC_FORMAT_MACROS' '-DOPENSSL_NO_PINSHARED' '-DOPENSSL_THREADS' '-DLIBSASS_VERSION="3.5.5"' -I/home/komissarov/.node-gyp/16.11.1/include/node -I/home/komissarov/.node-gyp/16.11.1/src -I/home/komissarov/.node-gyp/16.11.1/deps/openssl/config -I/home/komissarov/.node-gyp/16.11.1/deps/openssl/openssl/include -I/home/komissarov/.node-gyp/16.11.1/deps/uv/include -I/home/komissarov/.node-gyp/16.11.1/deps/zlib -I/home/komissarov/.node-gyp/16.11.1/deps/v8/include -I../src/libsass/include  -fPIC -pthread -Wall -Wextra -Wno-unused-parameter -m64 -O3 -fno-omit-frame-pointer -std=gnu++14 -std=c++0x -fexceptions -frtti -MMD -MF ./Release/.deps/Release/obj.target/libsass/src/libsass/src/utf8_string.o.d.raw   -c -o Release/obj.target/libsass/src/libsass/src/utf8_string.o ../src/libsass/src/utf8_string.cpp
npm ERR!   g++ '-DNODE_GYP_MODULE_NAME=libsass' '-DUSING_UV_SHARED=1' '-DUSING_V8_SHARED=1' '-DV8_DEPRECATION_WARNINGS=1' '-DV8_DEPRECATION_WARNINGS' '-DV8_IMMINENT_DEPRECATION_WARNINGS' '-D_GLIBCXX_USE_CXX11_ABI=1' '-D_LARGEFILE_SOURCE' '-D_FILE_OFFSET_BITS=64' '-D__STDC_FORMAT_MACROS' '-DOPENSSL_NO_PINSHARED' '-DOPENSSL_THREADS' '-DLIBSASS_VERSION="3.5.5"' -I/home/komissarov/.node-gyp/16.11.1/include/node -I/home/komissarov/.node-gyp/16.11.1/src -I/home/komissarov/.node-gyp/16.11.1/deps/openssl/config -I/home/komissarov/.node-gyp/16.11.1/deps/openssl/openssl/include -I/home/komissarov/.node-gyp/16.11.1/deps/uv/include -I/home/komissarov/.node-gyp/16.11.1/deps/zlib -I/home/komissarov/.node-gyp/16.11.1/deps/v8/include -I../src/libsass/include  -fPIC -pthread -Wall -Wextra -Wno-unused-parameter -m64 -O3 -fno-omit-frame-pointer -std=gnu++14 -std=c++0x -fexceptions -frtti -MMD -MF ./Release/.deps/Release/obj.target/libsass/src/libsass/src/util.o.d.raw   -c -o Release/obj.target/libsass/src/libsass/src/util.o ../src/libsass/src/util.cpp
npm ERR!   g++ '-DNODE_GYP_MODULE_NAME=libsass' '-DUSING_UV_SHARED=1' '-DUSING_V8_SHARED=1' '-DV8_DEPRECATION_WARNINGS=1' '-DV8_DEPRECATION_WARNINGS' '-DV8_IMMINENT_DEPRECATION_WARNINGS' '-D_GLIBCXX_USE_CXX11_ABI=1' '-D_LARGEFILE_SOURCE' '-D_FILE_OFFSET_BITS=64' '-D__STDC_FORMAT_MACROS' '-DOPENSSL_NO_PINSHARED' '-DOPENSSL_THREADS' '-DLIBSASS_VERSION="3.5.5"' -I/home/komissarov/.node-gyp/16.11.1/include/node -I/home/komissarov/.node-gyp/16.11.1/src -I/home/komissarov/.node-gyp/16.11.1/deps/openssl/config -I/home/komissarov/.node-gyp/16.11.1/deps/openssl/openssl/include -I/home/komissarov/.node-gyp/16.11.1/deps/uv/include -I/home/komissarov/.node-gyp/16.11.1/deps/zlib -I/home/komissarov/.node-gyp/16.11.1/deps/v8/include -I../src/libsass/include  -fPIC -pthread -Wall -Wextra -Wno-unused-parameter -m64 -O3 -fno-omit-frame-pointer -std=gnu++14 -std=c++0x -fexceptions -frtti -MMD -MF ./Release/.deps/Release/obj.target/libsass/src/libsass/src/values.o.d.raw   -c -o Release/obj.target/libsass/src/libsass/src/values.o ../src/libsass/src/values.cpp
npm ERR!   rm -f Release/obj.target/src/sass.a && ar crs Release/obj.target/src/sass.a Release/obj.target/libsass/src/libsass/src/ast.o Release/obj.target/libsass/src/libsass/src/ast_fwd_decl.o Release/obj.target/libsass/src/libsass/src/backtrace.o Release/obj.target/libsass/src/libsass/src/base64vlq.o Release/obj.target/libsass/src/libsass/src/bind.o Release/obj.target/libsass/src/libsass/src/cencode.o Release/obj.target/libsass/src/libsass/src/check_nesting.o Release/obj.target/libsass/src/libsass/src/color_maps.o Release/obj.target/libsass/src/libsass/src/constants.o Release/obj.target/libsass/src/libsass/src/context.o Release/obj.target/libsass/src/libsass/src/cssize.o Release/obj.target/libsass/src/libsass/src/emitter.o Release/obj.target/libsass/src/libsass/src/environment.o Release/obj.target/libsass/src/libsass/src/error_handling.o Release/obj.target/libsass/src/libsass/src/eval.o Release/obj.target/libsass/src/libsass/src/expand.o Release/obj.target/libsass/src/libsass/src/extend.o Release/obj.target/libsass/src/libsass/src/file.o Release/obj.target/libsass/src/libsass/src/functions.o Release/obj.target/libsass/src/libsass/src/inspect.o Release/obj.target/libsass/src/libsass/src/json.o Release/obj.target/libsass/src/libsass/src/lexer.o Release/obj.target/libsass/src/libsass/src/listize.o Release/obj.target/libsass/src/libsass/src/memory/SharedPtr.o Release/obj.target/libsass/src/libsass/src/node.o Release/obj.target/libsass/src/libsass/src/operators.o Release/obj.target/libsass/src/libsass/src/output.o Release/obj.target/libsass/src/libsass/src/parser.o Release/obj.target/libsass/src/libsass/src/plugins.o Release/obj.target/libsass/src/libsass/src/position.o Release/obj.target/libsass/src/libsass/src/prelexer.o Release/obj.target/libsass/src/libsass/src/remove_placeholders.o Release/obj.target/libsass/src/libsass/src/sass.o Release/obj.target/libsass/src/libsass/src/sass2scss.o Release/obj.target/libsass/src/libsass/src/sass_context.o Release/obj.target/libsass/src/libsass/src/sass_functions.o Release/obj.target/libsass/src/libsass/src/sass_util.o Release/obj.target/libsass/src/libsass/src/sass_values.o Release/obj.target/libsass/src/libsass/src/source_map.o Release/obj.target/libsass/src/libsass/src/subset_map.o Release/obj.target/libsass/src/libsass/src/to_c.o Release/obj.target/libsass/src/libsass/src/to_value.o Release/obj.target/libsass/src/libsass/src/units.o Release/obj.target/libsass/src/libsass/src/utf8_string.o Release/obj.target/libsass/src/libsass/src/util.o Release/obj.target/libsass/src/libsass/src/values.o
npm ERR!   rm -rf "Release/sass.a" && cp -af "Release/obj.target/src/sass.a" "Release/sass.a"
npm ERR!   g++ '-DNODE_GYP_MODULE_NAME=binding' '-DUSING_UV_SHARED=1' '-DUSING_V8_SHARED=1' '-DV8_DEPRECATION_WARNINGS=1' '-DV8_DEPRECATION_WARNINGS' '-DV8_IMMINENT_DEPRECATION_WARNINGS' '-D_GLIBCXX_USE_CXX11_ABI=1' '-D_LARGEFILE_SOURCE' '-D_FILE_OFFSET_BITS=64' '-D__STDC_FORMAT_MACROS' '-DOPENSSL_NO_PINSHARED' '-DOPENSSL_THREADS' '-DBUILDING_NODE_EXTENSION' -I/home/komissarov/.node-gyp/16.11.1/include/node -I/home/komissarov/.node-gyp/16.11.1/src -I/home/komissarov/.node-gyp/16.11.1/deps/openssl/config -I/home/komissarov/.node-gyp/16.11.1/deps/openssl/openssl/include -I/home/komissarov/.node-gyp/16.11.1/deps/uv/include -I/home/komissarov/.node-gyp/16.11.1/deps/zlib -I/home/komissarov/.node-gyp/16.11.1/deps/v8/include -I../../../../nan -I../src/libsass/include  -fPIC -pthread -Wall -Wextra -Wno-unused-parameter -m64 -O3 -fno-omit-frame-pointer -fno-rtti -fno-exceptions -std=gnu++14 -std=c++0x -MMD -MF ./Release/.deps/Release/obj.target/binding/src/binding.o.d.raw   -c -o Release/obj.target/binding/src/binding.o ../src/binding.cpp
npm ERR! make: выход из каталога «/home/komissarov/project/potato/node_modules/gulp-sass/node_modules/node-sass/build»
npm ERR! gyp info it worked if it ends with ok
npm ERR! gyp verb cli [
npm ERR! gyp verb cli   '/usr/bin/node',
npm ERR! gyp verb cli   '/home/komissarov/project/potato/node_modules/gulp-sass/node_modules/node-gyp/bin/node-gyp.js',
npm ERR! gyp verb cli   'rebuild',
npm ERR! gyp verb cli   '--verbose',
npm ERR! gyp verb cli   '--libsass_ext=',
npm ERR! gyp verb cli   '--libsass_cflags=',
npm ERR! gyp verb cli   '--libsass_ldflags=',
npm ERR! gyp verb cli   '--libsass_library='
npm ERR! gyp verb cli ]
npm ERR! gyp info using node-gyp@3.8.0
npm ERR! gyp info using node@16.11.1 | linux | x64
npm ERR! gyp verb command rebuild []
npm ERR! gyp verb command clean []
npm ERR! gyp verb clean removing "build" directory
npm ERR! gyp verb command configure []
npm ERR! gyp verb check python checking for Python executable "python2" in the PATH
npm ERR! gyp verb `which` succeeded python2 /usr/bin/python2
npm ERR! gyp verb check python version `/usr/bin/python2 -c "import sys; print "2.7.16
npm ERR! gyp verb check python version .%s.%s" % sys.version_info[:3];"` returned: %j
npm ERR! gyp verb get node dir no --target version specified, falling back to host node version: 16.11.1
npm ERR! gyp verb command install [ '16.11.1' ]
npm ERR! gyp verb install input version string "16.11.1"
npm ERR! gyp verb install installing version: 16.11.1
npm ERR! gyp verb install --ensure was passed, so won't reinstall if already installed
npm ERR! gyp verb install version is already installed, need to check "installVersion"
npm ERR! gyp verb got "installVersion" 9
npm ERR! gyp verb needs "installVersion" 9
npm ERR! gyp verb install version is good
npm ERR! gyp verb get node dir target node version installed: 16.11.1
npm ERR! gyp verb build dir attempting to create "build" dir: /home/komissarov/project/potato/node_modules/gulp-sass/node_modules/node-sass/build
npm ERR! gyp verb build dir "build" dir needed to be created? /home/komissarov/project/potato/node_modules/gulp-sass/node_modules/node-sass/build
npm ERR! gyp verb build/config.gypi creating config file
npm ERR! gyp verb build/config.gypi writing out config file: /home/komissarov/project/potato/node_modules/gulp-sass/node_modules/node-sass/build/config.gypi
npm ERR! (node:2874) [DEP0150] DeprecationWarning: Setting process.config is deprecated. In the future the property will be read-only.
npm ERR! (Use `node --trace-deprecation ...` to show where the warning was created)
npm ERR! gyp verb config.gypi checking for gypi file: /home/komissarov/project/potato/node_modules/gulp-sass/node_modules/node-sass/config.gypi
npm ERR! gyp verb common.gypi checking for gypi file: /home/komissarov/project/potato/node_modules/gulp-sass/node_modules/node-sass/common.gypi
npm ERR! gyp verb gyp gyp format was not specified; forcing "make"
npm ERR! gyp info spawn /usr/bin/python2
npm ERR! gyp info spawn args [
npm ERR! gyp info spawn args   '/home/komissarov/project/potato/node_modules/gulp-sass/node_modules/node-gyp/gyp/gyp_main.py',
npm ERR! gyp info spawn args   'binding.gyp',
npm ERR! gyp info spawn args   '-f',
npm ERR! gyp info spawn args   'make',
npm ERR! gyp info spawn args   '-I',
npm ERR! gyp info spawn args   '/home/komissarov/project/potato/node_modules/gulp-sass/node_modules/node-sass/build/config.gypi',
npm ERR! gyp info spawn args   '-I',
npm ERR! gyp info spawn args   '/home/komissarov/project/potato/node_modules/gulp-sass/node_modules/node-gyp/addon.gypi',
npm ERR! gyp info spawn args   '-I',
npm ERR! gyp info spawn args   '/home/komissarov/.node-gyp/16.11.1/include/node/common.gypi',
npm ERR! gyp info spawn args   '-Dlibrary=shared_library',
npm ERR! gyp info spawn args   '-Dvisibility=default',
npm ERR! gyp info spawn args   '-Dnode_root_dir=/home/komissarov/.node-gyp/16.11.1',
npm ERR! gyp info spawn args   '-Dnode_gyp_dir=/home/komissarov/project/potato/node_modules/gulp-sass/node_modules/node-gyp',
npm ERR! gyp info spawn args   '-Dnode_lib_file=/home/komissarov/.node-gyp/16.11.1/<(target_arch)/node.lib',
npm ERR! gyp info spawn args   '-Dmodule_root_dir=/home/komissarov/project/potato/node_modules/gulp-sass/node_modules/node-sass',
npm ERR! gyp info spawn args   '-Dnode_engine=v8',
npm ERR! gyp info spawn args   '--depth=.',
npm ERR! gyp info spawn args   '--no-parallel',
npm ERR! gyp info spawn args   '--generator-output',
npm ERR! gyp info spawn args   'build',
npm ERR! gyp info spawn args   '-Goutput_dir=.'
npm ERR! gyp info spawn args ]
npm ERR! gyp verb command build []
npm ERR! gyp verb build type Release
npm ERR! gyp verb architecture x64
npm ERR! gyp verb node dev dir /home/komissarov/.node-gyp/16.11.1
npm ERR! gyp verb `which` succeeded for `make` /usr/bin/make
npm ERR! gyp info spawn make
npm ERR! gyp info spawn args [ 'V=1', 'BUILDTYPE=Release', '-C', 'build' ]
npm ERR! ../src/libsass/src/cencode.c: In function ‘base64_encode_block’:
npm ERR! ../src/libsass/src/cencode.c:48:11: warning: this statement may fall through [-Wimplicit-fallthrough=]
npm ERR!     result = (fragment & 0x003) << 4;
npm ERR!     ~~~~~~~^~~~~~~~~~~~~~~~~~~~~~~~~
npm ERR! ../src/libsass/src/cencode.c:52:2: note: here
npm ERR!   case step_B:
npm ERR!   ^~~~
npm ERR! ../src/libsass/src/cencode.c:62:11: warning: this statement may fall through [-Wimplicit-fallthrough=]
npm ERR!     result = (fragment & 0x00f) << 2;
npm ERR!     ~~~~~~~^~~~~~~~~~~~~~~~~~~~~~~~~
npm ERR! ../src/libsass/src/cencode.c:66:2: note: here
npm ERR!   case step_C:
npm ERR!   ^~~~
npm ERR! ../src/libsass/src/functions.cpp: In function ‘void Sass::Functions::handle_utf8_error(const Sass::ParserState&, Sass::Backtraces)’:
npm ERR! ../src/libsass/src/functions.cpp:110:20: warning: catching polymorphic type ‘class utf8::invalid_code_point’ by value [-Wcatch-value=]
npm ERR!        catch (utf8::invalid_code_point) {
npm ERR!                     ^~~~~~~~~~~~~~~~~~
npm ERR! ../src/libsass/src/functions.cpp:114:20: warning: catching polymorphic type ‘class utf8::not_enough_room’ by value [-Wcatch-value=]
npm ERR!        catch (utf8::not_enough_room) {
npm ERR!                     ^~~~~~~~~~~~~~~
npm ERR! ../src/libsass/src/functions.cpp:118:20: warning: catching polymorphic type ‘class utf8::invalid_utf8’ by value [-Wcatch-value=]
npm ERR!        catch (utf8::invalid_utf8) {
npm ERR!                     ^~~~~~~~~~~~
npm ERR! ../src/libsass/src/json.cpp: In function ‘char* json_encode_string(const char*)’:
npm ERR! ../src/libsass/src/json.cpp:405:15: warning: catching polymorphic type ‘class std::exception’ by value [-Wcatch-value=]
npm ERR!    catch (std::exception) {
npm ERR!                ^~~~~~~~~
npm ERR! ../src/libsass/src/json.cpp: In function ‘char* json_stringify(const JsonNode*, const char*)’:
npm ERR! ../src/libsass/src/json.cpp:424:15: warning: catching polymorphic type ‘class std::exception’ by value [-Wcatch-value=]
npm ERR!    catch (std::exception) {
npm ERR!                ^~~~~~~~~
npm ERR! In file included from /home/komissarov/.node-gyp/16.11.1/include/node/v8.h:30,
npm ERR!                  from /home/komissarov/.node-gyp/16.11.1/include/node/node.h:63,
npm ERR!                  from ../../../../nan/nan.h:58,
npm ERR!                  from ../src/binding.cpp:1:
npm ERR! /home/komissarov/.node-gyp/16.11.1/include/node/v8-internal.h: In function ‘void v8::internal::PerformCastCheck(T*)’:
npm ERR! /home/komissarov/.node-gyp/16.11.1/include/node/v8-internal.h:492:38: error: ‘remove_cv_t’ is not a member of ‘std’
npm ERR!              !std::is_same<Data, std::remove_cv_t<T>>::value>::Perform(data);
npm ERR!                                       ^~~~~~~~~~~
npm ERR! /home/komissarov/.node-gyp/16.11.1/include/node/v8-internal.h:492:38: note: suggested alternative: ‘remove_cv’
npm ERR!              !std::is_same<Data, std::remove_cv_t<T>>::value>::Perform(data);
npm ERR!                                       ^~~~~~~~~~~
npm ERR!                                       remove_cv
npm ERR! /home/komissarov/.node-gyp/16.11.1/include/node/v8-internal.h:492:38: error: ‘remove_cv_t’ is not a member of ‘std’
npm ERR! /home/komissarov/.node-gyp/16.11.1/include/node/v8-internal.h:492:38: note: suggested alternative: ‘remove_cv’
npm ERR!              !std::is_same<Data, std::remove_cv_t<T>>::value>::Perform(data);
npm ERR!                                       ^~~~~~~~~~~
npm ERR!                                       remove_cv
npm ERR! /home/komissarov/.node-gyp/16.11.1/include/node/v8-internal.h:492:50: error: template argument 2 is invalid
npm ERR!              !std::is_same<Data, std::remove_cv_t<T>>::value>::Perform(data);
npm ERR!                                                   ^
npm ERR! /home/komissarov/.node-gyp/16.11.1/include/node/v8-internal.h:492:63: error: ‘::Perform’ has not been declared
npm ERR!              !std::is_same<Data, std::remove_cv_t<T>>::value>::Perform(data);
npm ERR!                                                                ^~~~~~~
npm ERR! /home/komissarov/.node-gyp/16.11.1/include/node/v8-internal.h:492:63: note: suggested alternative: ‘herror’
npm ERR!              !std::is_same<Data, std::remove_cv_t<T>>::value>::Perform(data);
npm ERR!                                                                ^~~~~~~
npm ERR!                                                                herror
npm ERR! ../src/binding.cpp: In function ‘Nan::NAN_METHOD_RETURN_TYPE render(Nan::NAN_METHOD_ARGS_TYPE)’:
npm ERR! ../src/binding.cpp:284:98: warning: cast between incompatible function types from ‘void (*)(uv_work_t*)’ {aka ‘void (*)(uv_work_s*)’} to ‘uv_after_work_cb’ {aka ‘void (*)(uv_work_s*, int)’} [-Wcast-function-type]
npm ERR!      int status = uv_queue_work(uv_default_loop(), &ctx_w->request, compile_it, (uv_after_work_cb)MakeCallback);
npm ERR!                                                                                                   ^~~~~~~~~~~~
npm ERR! ../src/binding.cpp: In function ‘Nan::NAN_METHOD_RETURN_TYPE render_file(Nan::NAN_METHOD_ARGS_TYPE)’:
npm ERR! ../src/binding.cpp:320:98: warning: cast between incompatible function types from ‘void (*)(uv_work_t*)’ {aka ‘void (*)(uv_work_s*)’} to ‘uv_after_work_cb’ {aka ‘void (*)(uv_work_s*, int)’} [-Wcast-function-type]
npm ERR!      int status = uv_queue_work(uv_default_loop(), &ctx_w->request, compile_it, (uv_after_work_cb)MakeCallback);
npm ERR!                                                                                                   ^~~~~~~~~~~~
npm ERR! In file included from ../../../../nan/nan.h:58,
npm ERR!                  from ../src/binding.cpp:1:
npm ERR! ../src/binding.cpp: At global scope:
npm ERR! /home/komissarov/.node-gyp/16.11.1/include/node/node.h:821:43: warning: cast between incompatible function types from ‘void (*)(Nan::ADDON_REGISTER_FUNCTION_ARGS_TYPE)’ {aka ‘void (*)(v8::Local<v8::Object>)’} to ‘node::addon_register_func’ {aka ‘void (*)(v8::Local<v8::Object>, v8::Local<v8::Value>, void*)’} [-Wcast-function-type]
npm ERR!        (node::addon_register_func) (regfunc),                          \
npm ERR!                                            ^
npm ERR! /home/komissarov/.node-gyp/16.11.1/include/node/node.h:855:3: note: in expansion of macro ‘NODE_MODULE_X’
npm ERR!    NODE_MODULE_X(modname, regfunc, NULL, 0)  // NOLINT (readability/null_usage)
npm ERR!    ^~~~~~~~~~~~~
npm ERR! ../src/binding.cpp:358:1: note: in expansion of macro ‘NODE_MODULE’
npm ERR!  NODE_MODULE(binding, RegisterModule);
npm ERR!  ^~~~~~~~~~~
npm ERR! make: *** [binding.target.mk:133: Release/obj.target/binding/src/binding.o] Ошибка 1
npm ERR! gyp ERR! build error 
npm ERR! gyp ERR! stack Error: `make` failed with exit code: 2
npm ERR! gyp ERR! stack     at ChildProcess.onExit (/home/komissarov/project/potato/node_modules/gulp-sass/node_modules/node-gyp/lib/build.js:262:23)
npm ERR! gyp ERR! stack     at ChildProcess.emit (node:events:390:28)
npm ERR! gyp ERR! stack     at Process.ChildProcess._handle.onexit (node:internal/child_process:290:12)
npm ERR! gyp ERR! System Linux 4.19.0-17-amd64
npm ERR! gyp ERR! command "/usr/bin/node" "/home/komissarov/project/potato/node_modules/gulp-sass/node_modules/node-gyp/bin/node-gyp.js" "rebuild" "--verbose" "--libsass_ext=" "--libsass_cflags=" "--libsass_ldflags=" "--libsass_library="
npm ERR! gyp ERR! cwd /home/komissarov/project/potato/node_modules/gulp-sass/node_modules/node-sass
npm ERR! gyp ERR! node -v v16.11.1
npm ERR! gyp ERR! node-gyp -v v3.8.0
npm ERR! gyp ERR! not ok 
npm ERR! Build failed with error code: 1

npm ERR! A complete log of this run can be found in:
npm ERR!     /home/komissarov/.npm/_logs/2021-10-18T21_21_03_198Z-debug.log