Untitled

mail@pastecode.io avatar
unknown
plain_text
2 years ago
8.3 kB
2
Indexable
Never
java.io.IOException: Cannot run program "npm" (in directory "/tmp/build_083553f9"): error=2, No such file or directory
           at java.lang.ProcessBuilder.start (ProcessBuilder.java:1048)
           at java.lang.Runtime.exec (Runtime.java:621)
           at org.apache.commons.exec.launcher.Java13CommandLauncher.exec (Java13CommandLauncher.java:61)
           at org.apache.commons.exec.DefaultExecutor.launch (DefaultExecutor.java:279)
           at org.apache.commons.exec.DefaultExecutor.executeInternal (DefaultExecutor.java:336)
           at org.apache.commons.exec.DefaultExecutor.execute (DefaultExecutor.java:166)
           at org.codehaus.mojo.exec.ExecMojo.executeCommandLine (ExecMojo.java:804)
           at org.codehaus.mojo.exec.ExecMojo.executeCommandLine (ExecMojo.java:751)
           at org.codehaus.mojo.exec.ExecMojo.execute (ExecMojo.java:313)
           at org.apache.maven.plugin.DefaultBuildPluginManager.executeMojo (DefaultBuildPluginManager.java:137)
           at org.apache.maven.lifecycle.internal.MojoExecutor.execute (MojoExecutor.java:210)
           at org.apache.maven.lifecycle.internal.MojoExecutor.execute (MojoExecutor.java:156)
           at org.apache.maven.lifecycle.internal.MojoExecutor.execute (MojoExecutor.java:148)
           at org.apache.maven.lifecycle.internal.LifecycleModuleBuilder.buildProject (LifecycleModuleBuilder.java:117)
           at org.apache.maven.lifecycle.internal.LifecycleModuleBuilder.buildProject (LifecycleModuleBuilder.java:81)
           at org.apache.maven.lifecycle.internal.builder.singlethreaded.SingleThreadedBuilder.build (SingleThreadedBuilder.java:56)
           at org.apache.maven.lifecycle.internal.LifecycleStarter.execute (LifecycleStarter.java:128)
           at org.apache.maven.DefaultMaven.doExecute (DefaultMaven.java:305)
           at org.apache.maven.DefaultMaven.doExecute (DefaultMaven.java:192)
           at org.apache.maven.DefaultMaven.execute (DefaultMaven.java:105)
           at org.apache.maven.cli.MavenCli.execute (MavenCli.java:972)
           at org.apache.maven.cli.MavenCli.doMain (MavenCli.java:293)
           at org.apache.maven.cli.MavenCli.main (MavenCli.java:196)
           at sun.reflect.NativeMethodAccessorImpl.invoke0 (Native Method)
           at sun.reflect.NativeMethodAccessorImpl.invoke (NativeMethodAccessorImpl.java:62)
           at sun.reflect.DelegatingMethodAccessorImpl.invoke (DelegatingMethodAccessorImpl.java:43)
           at java.lang.reflect.Method.invoke (Method.java:498)
           at org.codehaus.plexus.classworlds.launcher.Launcher.launchEnhanced (Launcher.java:282)
           at org.codehaus.plexus.classworlds.launcher.Launcher.launch (Launcher.java:225)
           at org.codehaus.plexus.classworlds.launcher.Launcher.mainWithExitCode (Launcher.java:406)
           at org.codehaus.plexus.classworlds.launcher.Launcher.main (Launcher.java:347)
           at sun.reflect.NativeMethodAccessorImpl.invoke0 (Native Method)
           at sun.reflect.NativeMethodAccessorImpl.invoke (NativeMethodAccessorImpl.java:62)
           at sun.reflect.DelegatingMethodAccessorImpl.invoke (DelegatingMethodAccessorImpl.java:43)
           at java.lang.reflect.Method.invoke (Method.java:498)
           at org.apache.maven.wrapper.BootstrapMainStarter.start (BootstrapMainStarter.java:39)
           at org.apache.maven.wrapper.WrapperExecutor.execute (WrapperExecutor.java:122)
           at org.apache.maven.wrapper.MavenWrapperMain.main (MavenWrapperMain.java:61)
       Caused by: java.io.IOException: error=2, No such file or directory
           at java.lang.UNIXProcess.forkAndExec (Native Method)
           at java.lang.UNIXProcess.<init> (UNIXProcess.java:247)
           at java.lang.ProcessImpl.start (ProcessImpl.java:134)
           at java.lang.ProcessBuilder.start (ProcessBuilder.java:1029)
           at java.lang.Runtime.exec (Runtime.java:621)
           at org.apache.commons.exec.launcher.Java13CommandLauncher.exec (Java13CommandLauncher.java:61)
           at org.apache.commons.exec.DefaultExecutor.launch (DefaultExecutor.java:279)
           at org.apache.commons.exec.DefaultExecutor.executeInternal (DefaultExecutor.java:336)
           at org.apache.commons.exec.DefaultExecutor.execute (DefaultExecutor.java:166)
           at org.codehaus.mojo.exec.ExecMojo.executeCommandLine (ExecMojo.java:804)
           at org.codehaus.mojo.exec.ExecMojo.executeCommandLine (ExecMojo.java:751)
           at org.codehaus.mojo.exec.ExecMojo.execute (ExecMojo.java:313)
           at org.apache.maven.plugin.DefaultBuildPluginManager.executeMojo (DefaultBuildPluginManager.java:137)
           at org.apache.maven.lifecycle.internal.MojoExecutor.execute (MojoExecutor.java:210)
           at org.apache.maven.lifecycle.internal.MojoExecutor.execute (MojoExecutor.java:156)
           at org.apache.maven.lifecycle.internal.MojoExecutor.execute (MojoExecutor.java:148)
           at org.apache.maven.lifecycle.internal.LifecycleModuleBuilder.buildProject (LifecycleModuleBuilder.java:117)
           at org.apache.maven.lifecycle.internal.LifecycleModuleBuilder.buildProject (LifecycleModuleBuilder.java:81)
           at org.apache.maven.lifecycle.internal.builder.singlethreaded.SingleThreadedBuilder.build (SingleThreadedBuilder.java:56)
           at org.apache.maven.lifecycle.internal.LifecycleStarter.execute (LifecycleStarter.java:128)
           at org.apache.maven.DefaultMaven.doExecute (DefaultMaven.java:305)
           at org.apache.maven.DefaultMaven.doExecute (DefaultMaven.java:192)
           at org.apache.maven.DefaultMaven.execute (DefaultMaven.java:105)
           at org.apache.maven.cli.MavenCli.execute (MavenCli.java:972)
           at org.apache.maven.cli.MavenCli.doMain (MavenCli.java:293)
           at org.apache.maven.cli.MavenCli.main (MavenCli.java:196)
           at sun.reflect.NativeMethodAccessorImpl.invoke0 (Native Method)
           at sun.reflect.NativeMethodAccessorImpl.invoke (NativeMethodAccessorImpl.java:62)
           at sun.reflect.DelegatingMethodAccessorImpl.invoke (DelegatingMethodAccessorImpl.java:43)
           at java.lang.reflect.Method.invoke (Method.java:498)
           at org.codehaus.plexus.classworlds.launcher.Launcher.launchEnhanced (Launcher.java:282)
           at org.codehaus.plexus.classworlds.launcher.Launcher.launch (Launcher.java:225)
           at org.codehaus.plexus.classworlds.launcher.Launcher.mainWithExitCode (Launcher.java:406)
           at org.codehaus.plexus.classworlds.launcher.Launcher.main (Launcher.java:347)
           at sun.reflect.NativeMethodAccessorImpl.invoke0 (Native Method)
           at sun.reflect.NativeMethodAccessorImpl.invoke (NativeMethodAccessorImpl.java:62)
           at sun.reflect.DelegatingMethodAccessorImpl.invoke (DelegatingMethodAccessorImpl.java:43)
           at java.lang.reflect.Method.invoke (Method.java:498)
           at org.apache.maven.wrapper.BootstrapMainStarter.start (BootstrapMainStarter.java:39)
           at org.apache.maven.wrapper.WrapperExecutor.execute (WrapperExecutor.java:122)
           at org.apache.maven.wrapper.MavenWrapperMain.main (MavenWrapperMain.java:61)
       [INFO] ------------------------------------------------------------------------
       [INFO] BUILD FAILURE
       [INFO] ------------------------------------------------------------------------
       [INFO] Total time:  7.639 s
       [INFO] Finished at: 2022-01-07T11:47:59Z
       [INFO] ------------------------------------------------------------------------
       [ERROR] Failed to execute goal org.codehaus.mojo:exec-maven-plugin:1.6.0:exec (gulp-cli install) on project coinmitr: Command execution failed. Cannot run program "npm" (in directory "/tmp/build_083553f9"): error=2, No such file or directory -> [Help 1]
       [ERROR] 
       [ERROR] To see the full stack trace of the errors, re-run Maven with the -e switch.
       [ERROR] Re-run Maven using the -X switch to enable full debug logging.
       [ERROR] 
       [ERROR] For more information about the errors and possible solutions, please read the following articles:
       [ERROR] [Help 1] http://cwiki.apache.org/confluence/display/MAVEN/MojoExecutionException
 !     ERROR: Failed to build app with Maven