Untitled

mail@pastecode.io avatar
unknown
plain_text
a year ago
6.6 kB
3
Indexable
Never
> node-sass@4.14.1 install C:\Users\filipe.lacerda\Documents\plataformas\122-espiritosanto\node_modules\node-sass
> node scripts/install.js

Downloading binary from https://github.com/sass/node-sass/releases/download/v4.14.1/win32-x64-83_binding.node
Cannot download "https://github.com/sass/node-sass/releases/download/v4.14.1/win32-x64-83_binding.node": 

tunneling socket could not be established, cause=getaddrinfo ENOTFOUND 3128

Hint: If github.com is not accessible in your location
      try setting a proxy via HTTP_PROXY, e.g.

      export HTTP_PROXY=http://example.com:1234

or configure npm proxy via

      npm config set proxy http://example.com:8080

> node-sass@4.14.1 postinstall C:\Users\filipe.lacerda\Documents\plataformas\122-espiritosanto\node_modules\node-sass
> node scripts/build.js

Building: C:\Program Files\nodejs\node.exe C:\Users\filipe.lacerda\Documents\plataformas\122-espiritosanto\node_modules\node-gyp\bin\node-gyp.js rebuild --verbose --libsass_ext= --libsass_cflags= --libsass_ldflags= --libsass_library=
gyp info it worked if it ends with ok
gyp verb cli [
gyp verb cli   'C:\\Program Files\\nodejs\\node.exe',
gyp verb cli   'C:\\Users\\filipe.lacerda\\Documents\\plataformas\\122-espiritosanto\\node_modules\\node-gyp\\bin\\node-gyp.js',
gyp verb cli   'rebuild',
gyp verb cli   '--verbose',
gyp verb cli   '--libsass_ext=',
gyp verb cli   '--libsass_cflags=',
gyp verb cli   '--libsass_ldflags=',
gyp verb cli   '--libsass_library='
gyp verb cli ]
gyp info using node-gyp@3.8.0
gyp info using node@14.21.3 | win32 | x64
gyp verb command rebuild []
gyp verb command clean []
gyp verb clean removing "build" directory
gyp verb command configure []
gyp verb check python checking for Python executable "python2" in the PATH
gyp verb `which` failed Error: not found: python2
gyp verb `which` failed     at getNotFoundError (C:\Users\filipe.lacerda\Documents\plataformas\122-espiritosanto\node_modules\node-gyp\node_modules\which\which.js:13:12)
gyp verb `which` failed     at F (C:\Users\filipe.lacerda\Documents\plataformas\122-espiritosanto\node_modules\node-gyp\node_modules\which\which.js:68:19)
gyp verb `which` failed     at E (C:\Users\filipe.lacerda\Documents\plataformas\122-espiritosanto\node_modules\node-gyp\node_modules\which\which.js:80:29)
gyp verb `which` failed     at C:\Users\filipe.lacerda\Documents\plataformas\122-espiritosanto\node_modules\node-gyp\node_modules\which\which.js:89:16
gyp verb `which` failed     at C:\Users\filipe.lacerda\Documents\plataformas\122-espiritosanto\node_modules\isexe\index.js:42:5
gyp verb `which` failed     at C:\Users\filipe.lacerda\Documents\plataformas\122-espiritosanto\node_modules\isexe\windows.js:36:5
gyp verb `which` failed     at FSReqCallback.oncomplete (fs.js:192:21)
gyp verb `which` failed  python2 Error: not found: python2
gyp verb `which` failed     at getNotFoundError (C:\Users\filipe.lacerda\Documents\plataformas\122-espiritosanto\node_modules\node-gyp\node_modules\which\which.js:13:12)
gyp verb `which` failed     at F (C:\Users\filipe.lacerda\Documents\plataformas\122-espiritosanto\node_modules\node-gyp\node_modules\which\which.js:68:19)
gyp verb `which` failed     at E (C:\Users\filipe.lacerda\Documents\plataformas\122-espiritosanto\node_modules\node-gyp\node_modules\which\which.js:80:29)
gyp verb `which` failed     at C:\Users\filipe.lacerda\Documents\plataformas\122-espiritosanto\node_modules\node-gyp\node_modules\which\which.js:89:16
gyp verb `which` failed     at C:\Users\filipe.lacerda\Documents\plataformas\122-espiritosanto\node_modules\isexe\index.js:42:5
gyp verb `which` failed     at C:\Users\filipe.lacerda\Documents\plataformas\122-espiritosanto\node_modules\isexe\windows.js:36:5
gyp verb `which` failed     at FSReqCallback.oncomplete (fs.js:192:21) {
gyp verb `which` failed   code: 'ENOENT'
gyp verb `which` failed }
gyp verb check python checking for Python executable "python" in the PATH
gyp verb `which` succeeded python C:\Users\filipe.lacerda\AppData\Local\Programs\Python\Python311\python.EXE
gyp ERR! configure error 
gyp ERR! stack Error: Command failed: C:\Users\filipe.lacerda\AppData\Local\Programs\Python\Python311\python.EXE -c import sys; print "%s.%s.%s" % sys.version_info[:3];
gyp ERR! stack   File "<string>", line 1
gyp ERR! stack     import sys; print "%s.%s.%s" % sys.version_info[:3];
gyp ERR! stack                 ^^^^^^^^^^^^^^^^^^^^^^^^^^^^^^^^^^^^^^^
gyp ERR! stack SyntaxError: Missing parentheses in call to 'print'. Did you mean print(...)?
gyp ERR! stack
gyp ERR! stack     at ChildProcess.exithandler (child_process.js:383:12)
gyp ERR! stack     at ChildProcess.emit (events.js:400:28)
gyp ERR! stack     at maybeClose (internal/child_process.js:1088:16)
gyp ERR! stack     at Process.ChildProcess._handle.onexit (internal/child_process.js:296:5)
gyp ERR! System Windows_NT 10.0.19042
gyp ERR! command "C:\\Program Files\\nodejs\\node.exe" "C:\\Users\\filipe.lacerda\\Documents\\plataformas\\122-espiritosanto\\node_modules\\node-gyp\\bin\\node-gyp.js" "rebuild" "--verbose" "--libsass_ext=" "--libsass_cflags=" "--libsass_ldflags=" "--libsass_library="
gyp ERR! cwd C:\Users\filipe.lacerda\Documents\plataformas\122-espiritosanto\node_modules\node-sass
gyp ERR! node -v v14.21.3
gyp ERR! node-gyp -v v3.8.0
gyp ERR! not ok
Build failed with error code: 1
npm WARN babel-loader@8.1.0 requires a peer of webpack@>=2 but none is installed. You must install peer dependencies yourself.
npm WARN plataforma-caed@19.2.0 No repository field.
npm WARN optional SKIPPING OPTIONAL DEPENDENCY: fsevents@2.3.2 (node_modules\fsevents):
npm WARN notsup SKIPPING OPTIONAL DEPENDENCY: Unsupported platform for fsevents@2.3.2: wanted {"os":"darwin","arch":"any"} (current: {"os":"win32","arch":"x64"})
npm WARN optional SKIPPING OPTIONAL DEPENDENCY: fsevents@1.2.13 (node_modules\glob-watcher\node_modules\fsevents):
npm WARN notsup SKIPPING OPTIONAL DEPENDENCY: Unsupported platform for fsevents@1.2.13: wanted {"os":"darwin","arch":"any"} (current: {"os":"win32","arch":"x64"})

npm ERR! code ELIFECYCLE
npm ERR! errno 1
npm ERR! node-sass@4.14.1 postinstall: `node scripts/build.js`
npm ERR! Exit status 1
npm ERR!
npm ERR! Failed at the node-sass@4.14.1 postinstall script.
npm ERR! This is probably not a problem with npm. There is likely additional logging output above.

npm ERR! A complete log of this run can be found in:
npm ERR!     C:\Users\filipe.lacerda\AppData\Roaming\npm-cache\_logs\2023-04-18T13_21_46_822Z-debug.log