Untitled

mail@pastecode.io avatar
unknown
plain_text
a year ago
32 kB
1
Indexable
Never
Job started: Publish to 'web'|INFO [Deploy] Checking all sites sequentially (2).|INFO [Deploy] Site "aon-preview" is skipped because current publish target database is "web" which differs from site's context database (<site name="aon-preview" ... database="master" ... />)|INFO Uniform service is ready, version: 7.0.220726-1|Items created: 7|Items deleted: 0|Items updated: 5|Items skipped: 2271|INFO [Deploy] Checking all sites sequentially (2).|INFO [Deploy] Starting deployment for site "aon"|INFO Reading timestamp via Azure API '2023-06-30T09:13:22.0236549Z', path: /uniform/api/content/aon/.Aon.7.0.230224-2.timestamp.txt, raw: 2023-06-30T09:13:22.0236549Z|INFO Retrieved 12 event(s) from EventQueue.|INFO Reading timestamp via Azure API '2023-06-30T09:13:22.0236549Z', path: /.aon.media.timestamp.txt, raw: 2023-06-30T09:13:22.0236549Z|INFO Retrieved 12 event(s) from EventQueue.|INFO Starting content and media deployment for site "aon"|INFO Scope.Pages(site: "aon"): 3
- /en/insights/t03-topic/t06-report
- /en/insights/t03-topic/t07-article
- /en/capabilities/investment-management|INFO Writing timestamp '2023-07-02T07:31:59.6009768Z', URL: https://aonqaxpscaledcntcache.blob.core.windows.net/$web/uniform/api/content/aon/.Aon.7.0.230224-2.timestamp.txt|INFO Reading last successful deployment timestamp '2023-06-28T15:54:33.8987090Z', URL: https://aonqaxpscaledhtml.z20.web.core.windows.net/.Aon.7.0.230224-2.timestamp.txt, raw: 2023-06-28T15:54:33.8987090Z|INFO Retrieved 12 event(s) from EventQueue.|INFO Uniform service is ready, version: 7.0.220726-1|INFO [Deploy] Run external service for aon site.|INFO Deploy is in progress, status: {"status":"In progress","message":"Generating HTML site files","total":5,"time":"2023-07-02T07:32:13.335Z"}|INFO Deploy is in progress, status: {"status":"In progress","message":"Generating HTML site files","total":5,"time":"2023-07-02T07:32:15.348Z"}|INFO Deploy is in progress, status: {"status":"In progress","message":"Generating HTML site files","total":5,"time":"2023-07-02T07:32:17.363Z"}|INFO Deploy is in progress, status: {"status":"In progress","message":"Generating HTML site files","total":5,"time":"2023-07-02T07:32:19.379Z"}|INFO Deploy is in progress, status: {"status":"In progress","message":"Generating HTML site files","total":5,"time":"2023-07-02T07:32:21.383Z"}|INFO Deploy is in progress, status: {"status":"In progress","message":"Generating HTML site files","total":5,"time":"2023-07-02T07:32:23.388Z"}|INFO Deploy is in progress, status: {"status":"In progress","message":"Generating HTML site files","total":5,"time":"2023-07-02T07:32:25.393Z"}|INFO Deploy is in progress, status: {"status":"In progress","message":"Generating HTML site files","total":5,"time":"2023-07-02T07:32:27.398Z"}|INFO Deploy is in progress, status: {"status":"In progress","message":"Generating HTML site files","total":5,"time":"2023-07-02T07:32:29.399Z"}|INFO Deploy is in progress, status: {"status":"In progress","message":"Generating HTML site files","total":5,"time":"2023-07-02T07:32:31.403Z"}|INFO Deploy is in progress, status: {"status":"In progress","message":"Generating HTML site files","total":5,"time":"2023-07-02T07:32:33.405Z"}|INFO Deploy is in progress, status: {"status":"In progress","message":"Generating HTML site files","total":5,"time":"2023-07-02T07:32:35.408Z"}|INFO Deploy is in progress, status: {"status":"In progress","message":"Generating HTML site files","total":5,"time":"2023-07-02T07:32:37.412Z"}|INFO Deploy is in progress, status: {"status":"In progress","message":"Generating HTML site files","total":5,"time":"2023-07-02T07:32:39.415Z"}|INFO Deploy is in progress, status: {"status":"In progress","message":"Generating HTML site files","total":5,"time":"2023-07-02T07:32:41.417Z"}|INFO Deploy is in progress, status: {"status":"In progress","message":"Generating HTML site files","total":5,"time":"2023-07-02T07:32:43.420Z"}|INFO Deploy is in progress, status: {"status":"In progress","message":"Generating HTML site files","total":5,"time":"2023-07-02T07:32:45.421Z"}|WARN Operation "Failed to deploy 3 pages" has failed. It will retry in 5s|WARN Retrying operation "Failed to deploy 3 pages"|INFO Deploy is in progress, status: {"status":"In progress","message":"Generating HTML site files","total":5,"time":"2023-07-02T07:32:53.440Z"}|INFO Deploy is in progress, status: {"status":"In progress","message":"Generating HTML site files","total":5,"time":"2023-07-02T07:32:55.453Z"}|INFO Deploy is in progress, status: {"status":"In progress","message":"Generating HTML site files","total":5,"time":"2023-07-02T07:32:57.456Z"}|INFO Deploy is in progress, status: {"status":"In progress","message":"Generating HTML site files","total":5,"time":"2023-07-02T07:32:59.459Z"}|INFO Deploy is in progress, status: {"status":"In progress","message":"Generating HTML site files","total":5,"time":"2023-07-02T07:33:01.465Z"}|INFO Deploy is in progress, status: {"status":"In progress","message":"Generating HTML site files","total":5,"time":"2023-07-02T07:33:03.468Z"}|INFO Deploy is in progress, status: {"status":"In progress","message":"Generating HTML site files","total":5,"time":"2023-07-02T07:33:05.473Z"}|INFO Deploy is in progress, status: {"status":"In progress","message":"Generating HTML site files","total":5,"time":"2023-07-02T07:33:07.477Z"}|INFO Deploy is in progress, status: {"status":"In progress","message":"Generating HTML site files","total":5,"time":"2023-07-02T07:33:09.481Z"}|INFO Deploy is in progress, status: {"status":"In progress","message":"Generating HTML site files","total":5,"time":"2023-07-02T07:33:11.485Z"}|INFO Deploy is in progress, status: {"status":"In progress","message":"Generating HTML site files","total":5,"time":"2023-07-02T07:33:13.489Z"}|WARN Operation "Failed to deploy 3 pages" has failed. It will retry in 5s|WARN Retrying operation "Failed to deploy 3 pages"|INFO Deploy is in progress, status: {"status":"In progress","message":"Generating HTML site files","total":5,"time":"2023-07-02T07:33:20.870Z"}|INFO Deploy is in progress, status: {"status":"In progress","message":"Generating HTML site files","total":5,"time":"2023-07-02T07:33:22.885Z"}|INFO Deploy is in progress, status: {"status":"In progress","message":"Generating HTML site files","total":5,"time":"2023-07-02T07:33:24.893Z"}|INFO Deploy is in progress, status: {"status":"In progress","message":"Generating HTML site files","total":5,"time":"2023-07-02T07:33:26.901Z"}|INFO Deploy is in progress, status: {"status":"In progress","message":"Generating HTML site files","total":5,"time":"2023-07-02T07:33:28.909Z"}|INFO Deploy is in progress, status: {"status":"In progress","message":"Generating HTML site files","total":5,"time":"2023-07-02T07:33:30.913Z"}|INFO Deploy is in progress, status: {"status":"In progress","message":"Generating HTML site files","total":5,"time":"2023-07-02T07:33:32.925Z"}|INFO Deploy is in progress, status: {"status":"In progress","message":"Generating HTML site files","total":5,"time":"2023-07-02T07:33:34.933Z"}|INFO Deploy is in progress, status: {"status":"In progress","message":"Generating HTML site files","total":5,"time":"2023-07-02T07:33:36.939Z"}|INFO Deploy is in progress, status: {"status":"In progress","message":"Generating HTML site files","total":5,"time":"2023-07-02T07:33:38.949Z"}|INFO Deploy is in progress, status: {"status":"In progress","message":"Generating HTML site files","total":5,"time":"2023-07-02T07:33:40.951Z"}|WARN Failed to update last usage date statistics counter, name: Error, message: The 'StringValue' should have the size of max 100 chars.|#Exception: System.Reflection.TargetInvocationException: Exception has been thrown by the target of an invocation. ---> System.InvalidOperationException: Deployment got interrupted due to error. This exception may contain sensitive data masked, the original exception is available separately with this log reference: 8DB7ACEAA57A61C ---> System.InvalidOperationException: Failed to deploy aon site ---> System.InvalidOperationException: Publish service job 1j1 failed, error: {
  "code": 1,
  "killed": false,
  "signal": null,
  "cmd": "node ./scripts/generate-sitemap.js && node node_modules/next/dist/bin/next build && node node_modules/next/dist/bin/next export --outdir \"/home/site/wwwroot/.temp/1j1/out\"",
  "stdout": "07/00-07:33:25  \u001b[32minfo\u001b[39m: \u001b[32mUniform version: 7.0.220726-1\u001b[39m \n07/00-07:33:25  \u001b[32minfo\u001b[39m: \u001b[32mLoading Uniform config...\u001b[39m \n07/00-07:33:25  \u001b[32minfo\u001b[39m: \u001b[32mpublicRuntimeConfig: {\"UNIFORM_API_URL\":\"https://aonqaxpscaledcntcache.z20.web.core.windows.net\",\"UNIFORM_API_SITENAME\":\"aon\",\"UNIFORM_CONTENT_URL\":\"https://aonqaxpscaledcntcache.z20.web.core.windows.net\",\"UNIFORM_API_MAPSERVICE\":\"/uniform/api/content/${UNIFORM_API_SITENAME}/map\",\"UNIFORM_OPTIONS_PREVIEW\":false,\"UNIFORM_OPTIONS_DEBUG\":false,\"UNIFORM_OPTIONS_PREFETCH_LINKS\":false,\"UNIFORM_OPTIONS_ESI\":true}\u001b[39m \ninfo  - Checking validity of types...\ninfo  - Creating an optimized production build...\ninfo  - Compiled successfully\ninfo  - Collecting page data...\n07/00-07:33:39  \u001b[32minfo\u001b[39m: \u001b[32mParsing .publish-map.json...\u001b[39m \ninfo  - Generating static pages (0/5)\ninfo  - Generating static pages (1/5)\nRendering 017081666d6a464197942675bd69c6d5 with key doesn't exist in htmlMap { key: '00000000000000000000000000000000|' }\ninfo  - Generating static pages (2/5)\nRendering bc6bf8d4cd4b4d4aa42aaebb6424117e with key doesn't exist in htmlMap {\n  key: '00000000000000000000000000000000|Mobile+Display=%7b6E50D5E2-04CC-41D2-8A38-F10E89AC4465%7d'\n}\nRendering 017081666d6a464197942675bd69c6d5 with key doesn't exist in htmlMap { key: '00000000000000000000000000000000|' }\ninfo  - Generating static pages (3/5)\ninfo  - Generating static pages (5/5)\n",
  "stderr": "Browserslist: caniuse-lite is outdated. Please run:\n  npx browserslist@latest --update-db\n  Why you should do it regularly: https://github.com/browserslist/browserslist#browsers-data-updating\nerror - ESLint must be installed in order to run during builds: npm install --save-dev eslint\nBrowserslist: caniuse-lite is outdated. Please run:\n  npx browserslist@latest --update-db\n  Why you should do it regularly: https://github.com/browserslist/browserslist#browsers-data-updating\n(node:20821) [DEP0148] DeprecationWarning: Use of deprecated folder mapping \"./src/\" in the \"exports\" field module resolution of the package at /home/site/wwwroot/node_modules/ramda/package.json.\nUpdate this package.json to use a subpath pattern like \"./src/*\".\n(Use `node --trace-deprecation ...` to show where the warning was created)\n\nError occurred prerendering page \"/404\". Read more: https://nextjs.org/docs/messages/prerender-error\nError: No item, ajax request to https://aonqaxpscaledcntcache.z20.web.core.windows.net/uniform/api/content/aon/page/notfound?uniform_esi=true&uniform_token=************ returned 404 code, text: The requested content does not exist.\n    at /home/site/wwwroot/node_modules/@uniformdev/common-client/dist/cjs/utils/getPageProps.js:72:31\n    at step (/home/site/wwwroot/node_modules/@uniformdev/common-client/dist/cjs/utils/getPageProps.js:33:23)\n    at Object.next (/home/site/wwwroot/node_modules/@uniformdev/common-client/dist/cjs/utils/getPageProps.js:14:53)\n    at fulfilled (/home/site/wwwroot/node_modules/@uniformdev/common-client/dist/cjs/utils/getPageProps.js:5:58)\n    at processTicksAndRejections (node:internal/process/task_queues:96:5)\nChanged javascript:void to # on node a\nChanged javascript:void to # on node a\nChanged javascript:void to # on node a\n\n> Build error occurred\nError: Export encountered errors on following paths:\n\t/404\n    at /home/site/wwwroot/node_modules/next/dist/export/index.js:397:19\n    at runMicrotasks (<anonymous>)\n    at processTicksAndRejections (node:internal/process/task_queues:96:5)\n    at async Span.traceAsyncFn (/home/site/wwwroot/node_modules/next/dist/trace/trace.js:79:20)\n    at async /home/site/wwwroot/node_modules/next/dist/build/index.js:999:17\n    at async Span.traceAsyncFn (/home/site/wwwroot/node_modules/next/dist/trace/trace.js:79:20)\n    at async /home/site/wwwroot/node_modules/next/dist/build/index.js:875:13\n    at async Span.traceAsyncFn (/home/site/wwwroot/node_modules/next/dist/trace/trace.js:79:20)\n    at async Object.build [as default] (/home/site/wwwroot/node_modules/next/dist/build/index.js:55:25)\n",
  "name": "Error",
  "message": "Command failed: node ./scripts/generate-sitemap.js && node node_modules/next/dist/bin/next build && node node_modules/next/dist/bin/next export --outdir \"/home/site/wwwroot/.temp/1j1/out\"\nBrowserslist: caniuse-lite is outdated. Please run:\n  npx browserslist@latest --update-db\n  Why you should do it regularly: https://github.com/browserslist/browserslist#browsers-data-updating\nerror - ESLint must be installed in order to run during builds: npm install --save-dev eslint\nBrowserslist: caniuse-lite is outdated. Please run:\n  npx browserslist@latest --update-db\n  Why you should do it regularly: https://github.com/browserslist/browserslist#browsers-data-updating\n(node:20821) [DEP0148] DeprecationWarning: Use of deprecated folder mapping \"./src/\" in the \"exports\" field module resolution of the package at /home/site/wwwroot/node_modules/ramda/package.json.\nUpdate this package.json to use a subpath pattern like \"./src/*\".\n(Use `node --trace-deprecation ...` to show where the warning was created)\n\nError occurred prerendering page \"/404\". Read more: https://nextjs.org/docs/messages/prerender-error\nError: No item, ajax request to https://aonqaxpscaledcntcache.z20.web.core.windows.net/uniform/api/content/aon/page/notfound?uniform_esi=true&uniform_token=************ returned 404 code, text: The requested content does not exist.\n    at /home/site/wwwroot/node_modules/@uniformdev/common-client/dist/cjs/utils/getPageProps.js:72:31\n    at step (/home/site/wwwroot/node_modules/@uniformdev/common-client/dist/cjs/utils/getPageProps.js:33:23)\n    at Object.next (/home/site/wwwroot/node_modules/@uniformdev/common-client/dist/cjs/utils/getPageProps.js:14:53)\n    at fulfilled (/home/site/wwwroot/node_modules/@uniformdev/common-client/dist/cjs/utils/getPageProps.js:5:58)\n    at processTicksAndRejections (node:internal/process/task_queues:96:5)\nChanged javascript:void to # on node a\nChanged javascript:void to # on node a\nChanged javascript:void to # on node a\n\n> Build error occurred\nError: Export encountered errors on following paths:\n\t/404\n    at /home/site/wwwroot/node_modules/next/dist/export/index.js:397:19\n    at runMicrotasks (<anonymous>)\n    at processTicksAndRejections (node:internal/process/task_queues:96:5)\n    at async Span.traceAsyncFn (/home/site/wwwroot/node_modules/next/dist/trace/trace.js:79:20)\n    at async /home/site/wwwroot/node_modules/next/dist/build/index.js:999:17\n    at async Span.traceAsyncFn (/home/site/wwwroot/node_modules/next/dist/trace/trace.js:79:20)\n    at async /home/site/wwwroot/node_modules/next/dist/build/index.js:875:13\n    at async Span.traceAsyncFn (/home/site/wwwroot/node_modules/next/dist/trace/trace.js:79:20)\n    at async Object.build [as default] (/home/site/wwwroot/node_modules/next/dist/build/index.js:55:25)\n",
  "stack": "Error: Command failed: node ./scripts/generate-sitemap.js && node node_modules/next/dist/bin/next build && node node_modules/next/dist/bin/next export --outdir \"/home/site/wwwroot/.temp/1j1/out\"\nBrowserslist: caniuse-lite is outdated. Please run:\n  npx browserslist@latest --update-db\n  Why you should do it regularly: https://github.com/browserslist/browserslist#browsers-data-updating\nerror - ESLint must be installed in order to run during builds: npm install --save-dev eslint\nBrowserslist: caniuse-lite is outdated. Please run:\n  npx browserslist@latest --update-db\n  Why you should do it regularly: https://github.com/browserslist/browserslist#browsers-data-updating\n(node:20821) [DEP0148] DeprecationWarning: Use of deprecated folder mapping \"./src/\" in the \"exports\" field module resolution of the package at /home/site/wwwroot/node_modules/ramda/package.json.\nUpdate this package.json to use a subpath pattern like \"./src/*\".\n(Use `node --trace-deprecation ...` to show where the warning was created)\n\nError occurred prerendering page \"/404\". Read more: https://nextjs.org/docs/messages/prerender-error\nError: No item, ajax request to https://aonqaxpscaledcntcache.z20.web.core.windows.net/uniform/api/content/aon/page/notfound?uniform_esi=true&uniform_token=************ returned 404 code, text: The requested content does not exist.\n    at /home/site/wwwroot/node_modules/@uniformdev/common-client/dist/cjs/utils/getPageProps.js:72:31\n    at step (/home/site/wwwroot/node_modules/@uniformdev/common-client/dist/cjs/utils/getPageProps.js:33:23)\n    at Object.next (/home/site/wwwroot/node_modules/@uniformdev/common-client/dist/cjs/utils/getPageProps.js:14:53)\n    at fulfilled (/home/site/wwwroot/node_modules/@uniformdev/common-client/dist/cjs/utils/getPageProps.js:5:58)\n    at processTicksAndRejections (node:internal/process/task_queues:96:5)\nChanged javascript:void to # on node a\nChanged javascript:void to # on node a\nChanged javascript:void to # on node a\n\n> Build error occurred\nError: Export encountered errors on following paths:\n\t/404\n    at /home/site/wwwroot/node_modules/next/dist/export/index.js:397:19\n    at runMicrotasks (<anonymous>)\n    at processTicksAndRejections (node:internal/process/task_queues:96:5)\n    at async Span.traceAsyncFn (/home/site/wwwroot/node_modules/next/dist/trace/trace.js:79:20)\n    at async /home/site/wwwroot/node_modules/next/dist/build/index.js:999:17\n    at async Span.traceAsyncFn (/home/site/wwwroot/node_modules/next/dist/trace/trace.js:79:20)\n    at async /home/site/wwwroot/node_modules/next/dist/build/index.js:875:13\n    at async Span.traceAsyncFn (/home/site/wwwroot/node_modules/next/dist/trace/trace.js:79:20)\n    at async Object.build [as default] (/home/site/wwwroot/node_modules/next/dist/build/index.js:55:25)\n\n    at ChildProcess.exithandler (node:child_process:402:12)\n    at ChildProcess.emit (node:events:513:28)\n    at ChildProcess.emit (node:domain:489:12)\n    at maybeClose (node:internal/child_process:1100:16)\n    at Process.ChildProcess._handle.onexit (node:internal/child_process:304:5)"
}, output: {"status":"Failed","message":"Failed to build and export site","error":{"code":1,"killed":false,"signal":null,"cmd":"node ./scripts/generate-sitemap.js && node node_modules/next/dist/bin/next build && node node_modules/next/dist/bin/next export --outdir \"/home/site/wwwroot/.temp/1j1/out\"","stdout":"07/00-07:33:25  \u001b[32minfo\u001b[39m: \u001b[32mUniform version: 7.0.220726-1\u001b[39m \n07/00-07:33:25  \u001b[32minfo\u001b[39m: \u001b[32mLoading Uniform config...\u001b[39m \n07/00-07:33:25  \u001b[32minfo\u001b[39m: \u001b[32mpublicRuntimeConfig: {\"UNIFORM_API_URL\":\"https://aonqaxpscaledcntcache.z20.web.core.windows.net\",\"UNIFORM_API_SITENAME\":\"aon\",\"UNIFORM_CONTENT_URL\":\"https://aonqaxpscaledcntcache.z20.web.core.windows.net\",\"UNIFORM_API_MAPSERVICE\":\"/uniform/api/content/${UNIFORM_API_SITENAME}/map\",\"UNIFORM_OPTIONS_PREVIEW\":false,\"UNIFORM_OPTIONS_DEBUG\":false,\"UNIFORM_OPTIONS_PREFETCH_LINKS\":false,\"UNIFORM_OPTIONS_ESI\":true}\u001b[39m \ninfo  - Checking validity of types...\ninfo  - Creating an optimized production build...\ninfo  - Compiled successfully\ninfo  - Collecting page data...\n07/00-07:33:39  \u001b[32minfo\u001b[39m: \u001b[32mParsing .publish-map.json...\u001b[39m \ninfo  - Generating static pages (0/5)\ninfo  - Generating static pages (1/5)\nRendering 017081666d6a464197942675bd69c6d5 with key doesn't exist in htmlMap { key: '00000000000000000000000000000000|' }\ninfo  - Generating static pages (2/5)\nRendering bc6bf8d4cd4b4d4aa42aaebb6424117e with key doesn't exist in htmlMap {\n  key: '00000000000000000000000000000000|Mobile+Display=%7b6E50D5E2-04CC-41D2-8A38-F10E89AC4465%7d'\n}\nRendering 017081666d6a464197942675bd69c6d5 with key doesn't exist in htmlMap { key: '00000000000000000000000000000000|' }\ninfo  - Generating static pages (3/5)\ninfo  - Generating static pages (5/5)\n","stderr":"Browserslist: caniuse-lite is outdated. Please run:\n  npx browserslist@latest --update-db\n  Why you should do it regularly: https://github.com/browserslist/browserslist#browsers-data-updating\nerror - ESLint must be installed in order to run during builds: npm install --save-dev eslint\nBrowserslist: caniuse-lite is outdated. Please run:\n  npx browserslist@latest --update-db\n  Why you should do it regularly: https://github.com/browserslist/browserslist#browsers-data-updating\n(node:20821) [DEP0148] DeprecationWarning: Use of deprecated folder mapping \"./src/\" in the \"exports\" field module resolution of the package at /home/site/wwwroot/node_modules/ramda/package.json.\nUpdate this package.json to use a subpath pattern like \"./src/*\".\n(Use `node --trace-deprecation ...` to show where the warning was created)\n\nError occurred prerendering page \"/404\". Read more: https://nextjs.org/docs/messages/prerender-error\nError: No item, ajax request to https://aonqaxpscaledcntcache.z20.web.core.windows.net/uniform/api/content/aon/page/notfound?uniform_esi=true&uniform_token=************ returned 404 code, text: The requested content does not exist.\n    at /home/site/wwwroot/node_modules/@uniformdev/common-client/dist/cjs/utils/getPageProps.js:72:31\n    at step (/home/site/wwwroot/node_modules/@uniformdev/common-client/dist/cjs/utils/getPageProps.js:33:23)\n    at Object.next (/home/site/wwwroot/node_modules/@uniformdev/common-client/dist/cjs/utils/getPageProps.js:14:53)\n    at fulfilled (/home/site/wwwroot/node_modules/@uniformdev/common-client/dist/cjs/utils/getPageProps.js:5:58)\n    at processTicksAndRejections (node:internal/process/task_queues:96:5)\nChanged javascript:void to # on node a\nChanged javascript:void to # on node a\nChanged javascript:void to # on node a\n\n> Build error occurred\nError: Export encountered errors on following paths:\n\t/404\n    at /home/site/wwwroot/node_modules/next/dist/export/index.js:397:19\n    at runMicrotasks (<anonymous>)\n    at processTicksAndRejections (node:internal/process/task_queues:96:5)\n    at async Span.traceAsyncFn (/home/site/wwwroot/node_modules/next/dist/trace/trace.js:79:20)\n    at async /home/site/wwwroot/node_modules/next/dist/build/index.js:999:17\n    at async Span.traceAsyncFn (/home/site/wwwroot/node_modules/next/dist/trace/trace.js:79:20)\n    at async /home/site/wwwroot/node_modules/next/dist/build/index.js:875:13\n    at async Span.traceAsyncFn (/home/site/wwwroot/node_modules/next/dist/trace/trace.js:79:20)\n    at async Object.build [as default] (/home/site/wwwroot/node_modules/next/dist/build/index.js:55:25)\n","name":"Error","message":"Command failed: node ./scripts/generate-sitemap.js && node node_modules/next/dist/bin/next build && node node_modules/next/dist/bin/next export --outdir \"/home/site/wwwroot/.temp/1j1/out\"\nBrowserslist: caniuse-lite is outdated. Please run:\n  npx browserslist@latest --update-db\n  Why you should do it regularly: https://github.com/browserslist/browserslist#browsers-data-updating\nerror - ESLint must be installed in order to run during builds: npm install --save-dev eslint\nBrowserslist: caniuse-lite is outdated. Please run:\n  npx browserslist@latest --update-db\n  Why you should do it regularly: https://github.com/browserslist/browserslist#browsers-data-updating\n(node:20821) [DEP0148] DeprecationWarning: Use of deprecated folder mapping \"./src/\" in the \"exports\" field module resolution of the package at /home/site/wwwroot/node_modules/ramda/package.json.\nUpdate this package.json to use a subpath pattern like \"./src/*\".\n(Use `node --trace-deprecation ...` to show where the warning was created)\n\nError occurred prerendering page \"/404\". Read more: https://nextjs.org/docs/messages/prerender-error\nError: No item, ajax request to https://aonqaxpscaledcntcache.z20.web.core.windows.net/uniform/api/content/aon/page/notfound?uniform_esi=true&uniform_token=************ returned 404 code, text: The requested content does not exist.\n    at /home/site/wwwroot/node_modules/@uniformdev/common-client/dist/cjs/utils/getPageProps.js:72:31\n    at step (/home/site/wwwroot/node_modules/@uniformdev/common-client/dist/cjs/utils/getPageProps.js:33:23)\n    at Object.next (/home/site/wwwroot/node_modules/@uniformdev/common-client/dist/cjs/utils/getPageProps.js:14:53)\n    at fulfilled (/home/site/wwwroot/node_modules/@uniformdev/common-client/dist/cjs/utils/getPageProps.js:5:58)\n    at processTicksAndRejections (node:internal/process/task_queues:96:5)\nChanged javascript:void to # on node a\nChanged javascript:void to # on node a\nChanged javascript:void to # on node a\n\n> Build error occurred\nError: Export encountered errors on following paths:\n\t/404\n    at /home/site/wwwroot/node_modules/next/dist/export/index.js:397:19\n    at runMicrotasks (<anonymous>)\n    at processTicksAndRejections (node:internal/process/task_queues:96:5)\n    at async Span.traceAsyncFn (/home/site/wwwroot/node_modules/next/dist/trace/trace.js:79:20)\n    at async /home/site/wwwroot/node_modules/next/dist/build/index.js:999:17\n    at async Span.traceAsyncFn (/home/site/wwwroot/node_modules/next/dist/trace/trace.js:79:20)\n    at async /home/site/wwwroot/node_modules/next/dist/build/index.js:875:13\n    at async Span.traceAsyncFn (/home/site/wwwroot/node_modules/next/dist/trace/trace.js:79:20)\n    at async Object.build [as default] (/home/site/wwwroot/node_modules/next/dist/build/index.js:55:25)\n","stack":"Error: Command failed: node ./scripts/generate-sitemap.js && node node_modules/next/dist/bin/next build && node node_modules/next/dist/bin/next export --outdir \"/home/site/wwwroot/.temp/1j1/out\"\nBrowserslist: caniuse-lite is outdated. Please run:\n  npx browserslist@latest --update-db\n  Why you should do it regularly: https://github.com/browserslist/browserslist#browsers-data-updating\nerror - ESLint must be installed in order to run during builds: npm install --save-dev eslint\nBrowserslist: caniuse-lite is outdated. Please run:\n  npx browserslist@latest --update-db\n  Why you should do it regularly: https://github.com/browserslist/browserslist#browsers-data-updating\n(node:20821) [DEP0148] DeprecationWarning: Use of deprecated folder mapping \"./src/\" in the \"exports\" field module resolution of the package at /home/site/wwwroot/node_modules/ramda/package.json.\nUpdate this package.json to use a subpath pattern like \"./src/*\".\n(Use `node --trace-deprecation ...` to show where the warning was created)\n\nError occurred prerendering page \"/404\". Read more: https://nextjs.org/docs/messages/prerender-error\nError: No item, ajax request to https://aonqaxpscaledcntcache.z20.web.core.windows.net/uniform/api/content/aon/page/notfound?uniform_esi=true&uniform_token=************ returned 404 code, text: The requested content does not exist.\n    at /home/site/wwwroot/node_modules/@uniformdev/common-client/dist/cjs/utils/getPageProps.js:72:31\n    at step (/home/site/wwwroot/node_modules/@uniformdev/common-client/dist/cjs/utils/getPageProps.js:33:23)\n    at Object.next (/home/site/wwwroot/node_modules/@uniformdev/common-client/dist/cjs/utils/getPageProps.js:14:53)\n    at fulfilled (/home/site/wwwroot/node_modules/@uniformdev/common-client/dist/cjs/utils/getPageProps.js:5:58)\n    at processTicksAndRejections (node:internal/process/task_queues:96:5)\nChanged javascript:void to # on node a\nChanged javascript:void to # on node a\nChanged javascript:void to # on node a\n\n> Build error occurred\nError: Export encountered errors on following paths:\n\t/404\n    at /home/site/wwwroot/node_modules/next/dist/export/index.js:397:19\n    at runMicrotasks (<anonymous>)\n    at processTicksAndRejections (node:internal/process/task_queues:96:5)\n    at async Span.traceAsyncFn (/home/site/wwwroot/node_modules/next/dist/trace/trace.js:79:20)\n    at async /home/site/wwwroot/node_modules/next/dist/build/index.js:999:17\n    at async Span.traceAsyncFn (/home/site/wwwroot/node_modules/next/dist/trace/trace.js:79:20)\n    at async /home/site/wwwroot/node_modules/next/dist/build/index.js:875:13\n    at async Span.traceAsyncFn (/home/site/wwwroot/node_modules/next/dist/trace/trace.js:79:20)\n    at async Object.build [as default] (/home/site/wwwroot/node_modules/next/dist/build/index.js:55:25)\n\n    at ChildProcess.exithandler (node:child_process:402:12)\n    at ChildProcess.emit (node:events:513:28)\n    at ChildProcess.emit (node:domain:489:12)\n    at maybeClose (node:internal/child_process:1100:16)\n    at Process.ChildProcess._handle.onexit (node:internal/child_process:304:5)"},"time":"2023-07-02T07:33:41.950Z"}
   at Uniform.Services.HostedDeploymentService.(String , String , DateTime& )
   at Uniform.Services.HostedDeploymentService.RunExternalService(IDictionary`2 pages, String timestamp)
   at Uniform.Pipelines.Deployment.RunExternalService..<Process>b__0()
   at Uniform.Helper.Retry[T](Func`1 act, Int32 num, String text, Int32 timeoutMs, Nullable`1 increasedTimeoutMs)
   at Uniform.Pipelines.Deployment.RunExternalService.Process(DeploymentArgs args)
   at (Object , Object )
   at Sitecore.Pipelines.CorePipeline.Run(PipelineArgs args)
   at Sitecore.Pipelines.DefaultCorePipelineManager.Run(String pipelineName, PipelineArgs args, String pipelineDomain, Boolean failIfNotExists)
   at Sitecore.Pipelines.DefaultCorePipelineManager.Run(String pipelineName, PipelineArgs args, String pipelineDomain)
   at Uniform.Services.DeploymentOrchestrationService.Deploy()
   --- End of inner exception stack trace ---
   at Uniform.Services.DeploymentOrchestrationService.Deploy()
   at Uniform.Pipelines.Publish.BasePublishProcessor.DoProcess(String targetDatabaseName, String[] languages)
   at Uniform.Pipelines.Publish.BasePublishProcessor.Process(PublishContext context)
   --- End of inner exception stack trace ---
   at Uniform.Pipelines.Publish.BasePublishProcessor.Process(PublishContext context)
   at (Object , Object )
   at Sitecore.Pipelines.CorePipeline.Run(PipelineArgs args)
   at Sitecore.Pipelines.DefaultCorePipelineManager.Run(String pipelineName, PipelineArgs args, String pipelineDomain, Boolean failIfNotExists)
   at Sitecore.Pipelines.DefaultCorePipelineManager.Run(String pipelineName, PipelineArgs args, String pipelineDomain)
   at Sitecore.Publishing.Pipelines.Publish.PublishPipeline.Run(PublishContext context)
   at Sitecore.Publishing.Publisher.PublishWithResult()
   --- End of inner exception stack trace ---
   at System.RuntimeMethodHandle.InvokeMethod(Object target, Object[] arguments, Signature sig, Boolean constructor)
   at System.Reflection.RuntimeMethodInfo.UnsafeInvokeInternal(Object obj, Object[] parameters, Object[] arguments)
   at System.Reflection.RuntimeMethodInfo.Invoke(Object obj, BindingFlags invokeAttr, Binder binder, Object[] parameters, CultureInfo culture)
   at Sitecore.Reflection.ReflectionUtil.InvokeMethod(MethodInfo method, Object[] parameters, Object obj)
   at Sitecore.Jobs.JobRunner.RunMethod(JobArgs args)
   at (Object , Object )
   at Sitecore.Pipelines.CorePipeline.Run(PipelineArgs args)
   at Sitecore.Pipelines.DefaultCorePipelineManager.Run(String pipelineName, PipelineArgs args, String pipelineDomain, Boolean failIfNotExists)
   at Sitecore.Pipelines.DefaultCorePipelineManager.Run(String pipelineName, PipelineArgs args, String pipelineDomain)
   at Sitecore.Jobs.DefaultJob.DoExecute()
   at Sitecore.Abstractions.BaseJob.ThreadEntry(Object state)