error

mail@pastecode.io avatar
unknown
plain_text
2 years ago
133 kB
1
Indexable
Never
12:25:39      export DEFINES_MODULE\=NO
12:25:39      export DEPLOYMENT_LOCATION\=YES
12:25:39      export DEPLOYMENT_POSTPROCESSING\=YES
12:25:39      export DEPLOYMENT_TARGET_CLANG_ENV_NAME\=IPHONEOS_DEPLOYMENT_TARGET
12:25:39      export DEPLOYMENT_TARGET_CLANG_FLAG_NAME\=miphoneos-version-min
12:25:39      export DEPLOYMENT_TARGET_CLANG_FLAG_PREFIX\=-miphoneos-version-min\=
12:25:39      export DEPLOYMENT_TARGET_LD_ENV_NAME\=IPHONEOS_DEPLOYMENT_TARGET
12:25:39      export DEPLOYMENT_TARGET_LD_FLAG_NAME\=ios_version_min
12:25:39      export DEPLOYMENT_TARGET_SETTING_NAME\=IPHONEOS_DEPLOYMENT_TARGET
12:25:39      export DEPLOYMENT_TARGET_SUGGESTED_VALUES\=9.0\ 9.1\ 9.2\ 9.3\ 10.0\ 10.1\ 10.2\ 10.3\ 11.0\ 11.1\ 11.2\ 11.3\ 11.4\ 12.0\ 12.1\ 12.2\ 12.3\ 12.4\ 13.0\ 13.1\ 13.2\ 13.3\ 13.4\ 13.5\ 13.6\ 14.0
12:25:39      export DERIVED_FILES_DIR\=/Users/jenkinsbuild/Library/Developer/Xcode/DerivedData/jitsi-meet-hbqumcnhzlykisdvlutciopijbco/Build/Intermediates.noindex/ArchiveIntermediates/JitsiMeet/IntermediateBuildFilesPath/app.build/ReleaseEnt-iphoneos/JitsiMeet.build/DerivedSources
12:25:39      export DERIVED_FILE_DIR\=/Users/jenkinsbuild/Library/Developer/Xcode/DerivedData/jitsi-meet-hbqumcnhzlykisdvlutciopijbco/Build/Intermediates.noindex/ArchiveIntermediates/JitsiMeet/IntermediateBuildFilesPath/app.build/ReleaseEnt-iphoneos/JitsiMeet.build/DerivedSources
12:25:39      export DERIVED_SOURCES_DIR\=/Users/jenkinsbuild/Library/Developer/Xcode/DerivedData/jitsi-meet-hbqumcnhzlykisdvlutciopijbco/Build/Intermediates.noindex/ArchiveIntermediates/JitsiMeet/IntermediateBuildFilesPath/app.build/ReleaseEnt-iphoneos/JitsiMeet.build/DerivedSources
12:25:39      export DERIVE_MACCATALYST_PRODUCT_BUNDLE_IDENTIFIER\=NO
12:25:39      export DEVELOPER_APPLICATIONS_DIR\=/Applications/Xcode12.0.app/Contents/Developer/Applications
12:25:39      export DEVELOPER_BIN_DIR\=/Applications/Xcode12.0.app/Contents/Developer/usr/bin
12:25:39      export DEVELOPER_DIR\=/Applications/Xcode12.0.app/Contents/Developer
12:25:39      export DEVELOPER_FRAMEWORKS_DIR\=/Applications/Xcode12.0.app/Contents/Developer/Library/Frameworks
12:25:39      export DEVELOPER_FRAMEWORKS_DIR_QUOTED\=/Applications/Xcode12.0.app/Contents/Developer/Library/Frameworks
12:25:39      export DEVELOPER_LIBRARY_DIR\=/Applications/Xcode12.0.app/Contents/Developer/Library
12:25:39      export DEVELOPER_SDK_DIR\=/Applications/Xcode12.0.app/Contents/Developer/Platforms/MacOSX.platform/Developer/SDKs
12:25:39      export DEVELOPER_TOOLS_DIR\=/Applications/Xcode12.0.app/Contents/Developer/Tools
12:25:39      export DEVELOPER_USR_DIR\=/Applications/Xcode12.0.app/Contents/Developer/usr
12:25:39      export DEVELOPMENT_LANGUAGE\=en
12:25:39      export DEVELOPMENT_TEAM\=LA4DZFY7SY
12:25:39      export DOCUMENTATION_FOLDER_PATH\=jitsi-meet.app/en.lproj/Documentation
12:25:39      export DONT_GENERATE_INFOPLIST_FILE\=NO
12:25:39      export DO_HEADER_SCANNING_IN_JAM\=NO
12:25:39      export DSTROOT\=/Users/jenkinsbuild/Library/Developer/Xcode/DerivedData/jitsi-meet-hbqumcnhzlykisdvlutciopijbco/Build/Intermediates.noindex/ArchiveIntermediates/JitsiMeet/InstallationBuildProductsLocation
12:25:39      export DT_TOOLCHAIN_DIR\=/Applications/Xcode12.0.app/Contents/Developer/Toolchains/XcodeDefault.xctoolchain
12:25:39      export DWARF_DSYM_FILE_NAME\=jitsi-meet.app.dSYM
12:25:39      export DWARF_DSYM_FILE_SHOULD_ACCOMPANY_PRODUCT\=NO
12:25:39      export DWARF_DSYM_FOLDER_PATH\=/Users/jenkinsbuild/jenkins-dss/workspace/72_bip-meet_sprint6_upgradeBuild/build/ReleaseEnt-iphoneos
12:25:39      export EFFECTIVE_PLATFORM_NAME\=-iphoneos
12:25:39      export EMBEDDED_CONTENT_CONTAINS_SWIFT\=NO
12:25:39      export EMBEDDED_PROFILE_NAME\=embedded.mobileprovision
12:25:39      export EMBED_ASSET_PACKS_IN_PRODUCT_BUNDLE\=NO
12:25:39      export ENABLE_BITCODE\=YES
12:25:39      export ENABLE_DEFAULT_HEADER_SEARCH_PATHS\=YES
12:25:39      export ENABLE_HARDENED_RUNTIME\=NO
12:25:39      export ENABLE_HEADER_DEPENDENCIES\=YES
12:25:39      export ENABLE_NS_ASSERTIONS\=NO
12:25:39      export ENABLE_ON_DEMAND_RESOURCES\=YES
12:25:39      export ENABLE_PREVIEWS\=NO
12:25:39      export ENABLE_STRICT_OBJC_MSGSEND\=YES
12:25:39      export ENABLE_TESTABILITY\=NO
12:25:39      export ENABLE_TESTING_SEARCH_PATHS\=NO
12:25:39      export ENTITLEMENTS_ALLOWED\=YES
12:25:39      export ENTITLEMENTS_DESTINATION\=Signature
12:25:39      export ENTITLEMENTS_REQUIRED\=YES
12:25:39      export EXCLUDED_INSTALLSRC_SUBDIRECTORY_PATTERNS\=.DS_Store\ .svn\ .git\ .hg\ CVS
12:25:39      export EXCLUDED_RECURSIVE_SEARCH_PATH_SUBDIRECTORIES\=\*.nib\ \*.lproj\ \*.framework\ \*.gch\ \*.xcode\*\ \*.xcassets\ \(\*\)\ .DS_Store\ CVS\ .svn\ .git\ .hg\ \*.pbproj\ \*.pbxproj
12:25:39      export EXECUTABLES_FOLDER_PATH\=jitsi-meet.app/Executables
12:25:39      export EXECUTABLE_FOLDER_PATH\=jitsi-meet.app
12:25:39      export EXECUTABLE_NAME\=jitsi-meet
12:25:39      export EXECUTABLE_PATH\=jitsi-meet.app/jitsi-meet
12:25:39      export EXPANDED_CODE_SIGN_IDENTITY\=571934C617E6AA93AABFC534D5B2EB0A68629D95
12:25:39      export EXPANDED_CODE_SIGN_IDENTITY_NAME\=iPhone\ Distribution:\ Turkcell\ Iletisim\ Hizmetleri\ A.\ S.
12:25:39      export EXPANDED_PROVISIONING_PROFILE\=15f79446-fde9-4e8c-bef4-970afc6c3f65
12:25:39      export FILE_LIST\=/Users/jenkinsbuild/Library/Developer/Xcode/DerivedData/jitsi-meet-hbqumcnhzlykisdvlutciopijbco/Build/Intermediates.noindex/ArchiveIntermediates/JitsiMeet/IntermediateBuildFilesPath/app.build/ReleaseEnt-iphoneos/JitsiMeet.build/Objects/LinkFileList
12:25:39      export FIXED_FILES_DIR\=/Users/jenkinsbuild/Library/Developer/Xcode/DerivedData/jitsi-meet-hbqumcnhzlykisdvlutciopijbco/Build/Intermediates.noindex/ArchiveIntermediates/JitsiMeet/IntermediateBuildFilesPath/app.build/ReleaseEnt-iphoneos/JitsiMeet.build/FixedFiles
12:25:39      export FRAMEWORKS_FOLDER_PATH\=jitsi-meet.app/Frameworks
12:25:39      export FRAMEWORK_FLAG_PREFIX\=-framework
12:25:39      export FRAMEWORK_SEARCH_PATHS\=/Users/jenkinsbuild/jenkins-dss/workspace/72_bip-meet_sprint6_upgradeBuild/build/ReleaseEnt-iphoneos\ 
12:25:39      export FRAMEWORK_VERSION\=A
12:25:39      export FULL_PRODUCT_NAME\=jitsi-meet.app
12:25:39      export GCC3_VERSION\=3.3
12:25:39      export GCC_C_LANGUAGE_STANDARD\=gnu99
12:25:39      export GCC_INLINES_ARE_PRIVATE_EXTERN\=YES
12:25:39      export GCC_NO_COMMON_BLOCKS\=YES
12:25:39      export GCC_PFE_FILE_C_DIALECTS\=c\ objective-c\ c++\ objective-c++
12:25:39      export GCC_PREPROCESSOR_DEFINITIONS\=\ COCOAPODS\=1
12:25:39      export GCC_SYMBOLS_PRIVATE_EXTERN\=YES
12:25:39      export GCC_THUMB_SUPPORT\=YES
12:25:39      export GCC_TREAT_WARNINGS_AS_ERRORS\=NO
12:25:39      export GCC_VERSION\=com.apple.compilers.llvm.clang.1_0
12:25:39      export GCC_VERSION_IDENTIFIER\=com_apple_compilers_llvm_clang_1_0
12:25:39      export GCC_WARN_64_TO_32_BIT_CONVERSION\=YES
12:25:39      export GCC_WARN_ABOUT_RETURN_TYPE\=YES_ERROR
12:25:39      export GCC_WARN_UNDECLARED_SELECTOR\=YES
12:25:39      export GCC_WARN_UNINITIALIZED_AUTOS\=YES_AGGRESSIVE
12:25:39      export GCC_WARN_UNUSED_FUNCTION\=YES
12:25:39      export GCC_WARN_UNUSED_VARIABLE\=YES
12:25:39      export GENERATED_MODULEMAP_DIR\=/Users/jenkinsbuild/Library/Developer/Xcode/DerivedData/jitsi-meet-hbqumcnhzlykisdvlutciopijbco/Build/Intermediates.noindex/ArchiveIntermediates/JitsiMeet/IntermediateBuildFilesPath/GeneratedModuleMaps-iphoneos
12:25:39      export GENERATE_MASTER_OBJECT_FILE\=NO
12:25:39      export GENERATE_PKGINFO_FILE\=YES
12:25:39      export GENERATE_PROFILING_CODE\=NO
12:25:39      export GENERATE_TEXT_BASED_STUBS\=NO
12:25:39      export GID\=1530679350
12:25:39      export GROUP\=1530679350
12:25:39      export HEADERMAP_INCLUDES_FLAT_ENTRIES_FOR_TARGET_BEING_BUILT\=YES
12:25:39      export HEADERMAP_INCLUDES_FRAMEWORK_ENTRIES_FOR_ALL_PRODUCT_TYPES\=YES
12:25:39      export HEADERMAP_INCLUDES_NONPUBLIC_NONPRIVATE_HEADERS\=YES
12:25:39      export HEADERMAP_INCLUDES_PROJECT_HEADERS\=YES
12:25:39      export HEADERMAP_USES_FRAMEWORK_PREFIX_ENTRIES\=YES
12:25:39      export HEADERMAP_USES_VFS\=NO
12:25:39      export HEADER_SEARCH_PATHS\=/Users/jenkinsbuild/jenkins-dss/workspace/72_bip-meet_sprint6_upgradeBuild/build/ReleaseEnt-iphoneos/include\ \ /Applications/Xcode.app/Contents/Developer/Toolchains/XcodeDefault.xctoolchain/usr/include\ \"/Users/jenkinsbuild/jenkins-dss/workspace/72_bip-meet_sprint6_upgradeBuild/ios/app/../Pods/Headers/Public\"\ \"/Users/jenkinsbuild/jenkins-dss/workspace/72_bip-meet_sprint6_upgradeBuild/ios/app/../Pods/Headers/Public/Adjust\"\ \"/Users/jenkinsbuild/jenkins-dss/workspace/72_bip-meet_sprint6_upgradeBuild/ios/app/../Pods/Headers/Public/Amplitude\"\ \"/Users/jenkinsbuild/jenkins-dss/workspace/72_bip-meet_sprint6_upgradeBuild/ios/app/../Pods/Headers/Public/AppAuth\"\ \"/Users/jenkinsbuild/jenkins-dss/workspace/72_bip-meet_sprint6_upgradeBuild/ios/app/../Pods/Headers/Public/CocoaLumberjack\"\ \"/Users/jenkinsbuild/jenkins-dss/workspace/72_bip-meet_sprint6_upgradeBuild/ios/app/../Pods/Headers/Public/DoubleConversion\"\ \"/Users/jenkinsbuild/jenkins-dss/workspace/72_bip-meet_sprint6_upgradeBuild/ios/app/../Pods/Headers/Public/FBLazyVector\"\ \"/Users/jenkinsbuild/jenkins-dss/workspace/72_bip-meet_sprint6_upgradeBuild/ios/app/../Pods/Headers/Public/FBReactNativeSpec\"\ \"/Users/jenkinsbuild/jenkins-dss/workspace/72_bip-meet_sprint6_upgradeBuild/ios/app/../Pods/Headers/Public/Firebase\"\ \"/Users/jenkinsbuild/jenkins-dss/workspace/72_bip-meet_sprint6_upgradeBuild/ios/app/../Pods/Headers/Public/FirebaseCore\"\ \"/Users/jenkinsbuild/jenkins-dss/workspace/72_bip-meet_sprint6_upgradeBuild/ios/app/../Pods/Headers/Public/FirebaseCoreDiagnostics\"\ \"/Users/jenkinsbuild/jenkins-dss/workspace/72_bip-meet_sprint6_upgradeBuild/ios/app/../Pods/Headers/Public/FirebaseCrashlytics\"\ \"/Users/jenkinsbuild/jenkins-dss/workspace/72_bip-meet_sprint6_upgradeBuild/ios/app/../Pods/Headers/Public/FirebaseDynamicLinks\"\ \"/Users/jenkinsbuild/jenkins-dss/workspace/72_bip-meet_sprint6_upgradeBuild/ios/app/../Pods/Headers/Public/FirebaseInstallations\"\ \"/Users/jenkinsbuild/jenkins-dss/workspace/72_bip-meet_sprint6_upgradeBuild/ios/app/../Pods/Headers/Public/GTMAppAuth\"\ \"/Users/jenkinsbuild/jenkins-dss/workspace/72_bip-meet_sprint6_upgradeBuild/ios/app/../Pods/Headers/Public/GTMSessionFetcher\"\ \"/Users/jenkinsbuild/jenkins-dss/workspace/72_bip-meet_sprint6_upgradeBuild/ios/app/../Pods/Headers/Public/GoogleDataTransport\"\ \"/Users/jenkinsbuild/jenkins-dss/workspace/72_bip-meet_sprint6_upgradeBuild/ios/app/../Pods/Headers/Public/GoogleUtilities\"\ \"/Users/jenkinsbuild/jenkins-dss/workspace/72_bip-meet_sprint6_upgradeBuild/ios/app/../Pods/Headers/Public/ObjectiveDropboxOfficial\"\ \"/Users/jenkinsbuild/jenkins-dss/workspace/72_bip-meet_sprint6_upgradeBuild/ios/app/../Pods/Headers/Public/Permission-Camera\"\ \"/Users/jenkinsbuild/jenkins-dss/workspace/72_bip-meet_sprint6_upgradeBuild/ios/app/../Pods/Headers/Public/Permission-Microphone\"\ \"/Users/jenkinsbuild/jenkins-dss/workspace/72_bip-meet_sprint6_upgradeBuild/ios/app/../Pods/Headers/Public/PromisesObjC\"\ \"/Users/jenkinsbuild/jenkins-dss/workspace/72_bip-meet_sprint6_upgradeBuild/ios/app/../Pods/Headers/Public/RCTRequired\"\ \"/Users/jenkinsbuild/jenkins-dss/workspace/72_bip-meet_sprint6_upgradeBuild/ios/app/../Pods/Headers/Public/RCTTypeSafety\"\ \"/Users/jenkinsbuild/jenkins-dss/workspace/72_bip-meet_sprint6_upgradeBuild/ios/app/../Pods/Headers/Public/RNCAsyncStorage\"\ \"/Users/jenkinsbuild/jenkins-dss/workspace/72_bip-meet_sprint6_upgradeBuild/ios/app/../Pods/Headers/Public/RNCCheckbox\"\ \"/Users/jenkinsbuild/jenkins-dss/workspace/72_bip-meet_sprint6_upgradeBuild/ios/app/../Pods/Headers/Public/RNCClipboard\"\ \"/Users/jenkinsbuild/jenkins-dss/workspace/72_bip-meet_sprint6_upgradeBuild/ios/app/../Pods/Headers/Public/RNCMaskedView\"\ \"/Users/jenkinsbuild/jenkins-dss/workspace/72_bip-meet_sprint6_upgradeBuild/ios/app/../Pods/Headers/Public/RNDefaultPreference\"\ \"/Users/jenkinsbuild/jenkins-dss/workspace/72_bip-meet_sprint6_upgradeBuild/ios/app/../Pods/Headers/Public/RNDeviceInfo\"\ \"/Users/jenkinsbuild/jenkins-dss/workspace/72_bip-meet_sprint6_upgradeBuild/ios/app/../Pods/Headers/Public/RNFBAnalytics\"\ \"/Users/jenkinsbuild/jenkins-dss/workspace/72_bip-meet_sprint6_upgradeBuild/ios/app/../Pods/Headers/Public/RNFBApp\"\ \"/Users/jenkinsbuild/jenkins-dss/workspace/72_bip-meet_sprint6_upgradeBuild/ios/app/../Pods/Headers/Public/RNFBCrashlytics\"\ \"/Users/jenkinsbuild/jenkins-dss/workspace/72_bip-meet_sprint6_upgradeBuild/ios/app/../Pods/Headers/Public/RNFBDynamicLinks\"\ \"/Users/jenkinsbuild/jenkins-dss/workspace/72_bip-meet_sprint6_upgradeBuild/ios/app/../Pods/Headers/Public/RNFS\"\ \"/Users/jenkinsbuild/jenkins-dss/workspace/72_bip-meet_sprint6_upgradeBuild/ios/app/../Pods/Headers/Public/RNFileLogger\"\ \"/Users/jenkinsbuild/jenkins-dss/workspace/72_bip-meet_sprint6_upgradeBuild/ios/app/../Pods/Headers/Public/RNGestureHandler\"\ \"/Users/jenkinsbuild/jenkins-dss/workspace/72_bip-meet_sprint6_upgradeBuild/ios/app/../Pods/Headers/Public/RNGoogleSignin\"\ \"/Users/jenkinsbuild/jenkins-dss/workspace/72_bip-meet_sprint6_upgradeBuild/ios/app/../Pods/Headers/Public/RNIap\"\ \"/Users/jenkinsbuild/jenkins-dss/workspace/72_bip-meet_sprint6_upgradeBuild/ios/app/../Pods/Headers/Public/RNPermissions\"\ \"/Users/jenkinsbuild/jenkins-dss/workspace/72_bip-meet_sprint6_upgradeBuild/ios/app/../Pods/Headers/Public/RNReanimated\"\ \"/Users/jenkinsbuild/jenkins-dss/workspace/72_bip-meet_sprint6_upgradeBuild/ios/app/../Pods/Headers/Public/RNSVG\"\ \"/Users/jenkinsbuild/jenkins-dss/workspace/72_bip-meet_sprint6_upgradeBuild/ios/app/../Pods/Headers/Public/RNScreens\"\ \"/Users/jenkinsbuild/jenkins-dss/workspace/72_bip-meet_sprint6_upgradeBuild/ios/app/../Pods/Headers/Public/RNSound\"\ \"/Users/jenkinsbuild/jenkins-dss/workspace/72_bip-meet_sprint6_upgradeBuild/ios/app/../Pods/Headers/Public/RNVectorIcons\"\ \"/Users/jenkinsbuild/jenkins-dss/workspace/72_bip-meet_sprint6_upgradeBuild/ios/app/../Pods/Headers/Public/RNWatch\"\ \"/Users/jenkinsbuild/jenkins-dss/workspace/72_bip-meet_sprint6_upgradeBuild/ios/app/../Pods/Headers/Public/RNZipArchive\"\ \"/Users/jenkinsbuild/jenkins-dss/workspace/72_bip-meet_sprint6_upgradeBuild/ios/app/../Pods/Headers/Public/React-Core\"\ \"/Users/jenkinsbuild/jenkins-dss/workspace/72_bip-meet_sprint6_upgradeBuild/ios/app/../Pods/Headers/Public/React-RCTBlob\"\ \"/Users/jenkinsbuild/jenkins-dss/workspace/72_bip-meet_sprint6_upgradeBuild/ios/app/../Pods/Headers/Public/React-RCTText\"\ \"/Users/jenkinsbuild/jenkins-dss/workspace/72_bip-meet_sprint6_upgradeBuild/ios/app/../Pods/Headers/Public/React-cxxreact\"\ \"/Users/jenkinsbuild/jenkins-dss/workspace/72_bip-meet_sprint6_upgradeBuild/ios/app/../Pods/Headers/Public/React-jsi\"\ \"/Users/jenkinsbuild/jenkins-dss/workspace/72_bip-meet_sprint6_upgradeBuild/ios/app/../Pods/Headers/Public/React-jsiexecutor\"\ \"/Users/jenkinsbuild/jenkins-dss/workspace/72_bip-meet_sprint6_upgradeBuild/ios/app/../Pods/Headers/Public/React-jsinspector\"\ \"/Users/jenkinsbuild/jenkins-dss/workspace/72_bip-meet_sprint6_upgradeBuild/ios/app/../Pods/Headers/Public/ReactCommon\"\ \"/Users/jenkinsbuild/jenkins-dss/workspace/72_bip-meet_sprint6_upgradeBuild/ios/app/../Pods/Headers/Public/SSZipArchive\"\ \"/Users/jenkinsbuild/jenkins-dss/workspace/72_bip-meet_sprint6_upgradeBuild/ios/app/../Pods/Headers/Public/Toast\"\ \"/Users/jenkinsbuild/jenkins-dss/workspace/72_bip-meet_sprint6_upgradeBuild/ios/app/../Pods/Headers/Public/Yoga\"\ \"/Users/jenkinsbuild/jenkins-dss/workspace/72_bip-meet_sprint6_upgradeBuild/ios/app/../Pods/Headers/Public/amplitude-react-native\"\ \"/Users/jenkinsbuild/jenkins-dss/workspace/72_bip-meet_sprint6_upgradeBuild/ios/app/../Pods/Headers/Public/glog\"\ \"/Users/jenkinsbuild/jenkins-dss/workspace/72_bip-meet_sprint6_upgradeBuild/ios/app/../Pods/Headers/Public/lottie-react-native\"\ \"/Users/jenkinsbuild/jenkins-dss/workspace/72_bip-meet_sprint6_upgradeBuild/ios/app/../Pods/Headers/Public/nanopb\"\ \"/Users/jenkinsbuild/jenkins-dss/workspace/72_bip-meet_sprint6_upgradeBuild/ios/app/../Pods/Headers/Public/react-native-adjust\"\ \"/Users/jenkinsbuild/jenkins-dss/workspace/72_bip-meet_sprint6_upgradeBuild/ios/app/../Pods/Headers/Public/react-native-background-timer\"\ \"/Users/jenkinsbuild/jenkins-dss/workspace/72_bip-meet_sprint6_upgradeBuild/ios/app/../Pods/Headers/Public/react-native-calendar-events\"\ \"/Users/jenkinsbuild/jenkins-dss/workspace/72_bip-meet_sprint6_upgradeBuild/ios/app/../Pods/Headers/Public/react-native-camera\"\ \"/Users/jenkinsbuild/jenkins-dss/workspace/72_bip-meet_sprint6_upgradeBuild/ios/app/../Pods/Headers/Public/react-native-config\"\ \"/Users/jenkinsbuild/jenkins-dss/workspace/72_bip-meet_sprint6_upgradeBuild/ios/app/../Pods/Headers/Public/react-native-image-picker\"\ \"/Users/jenkinsbuild/jenkins-dss/workspace/72_bip-meet_sprint6_upgradeBuild/ios/app/../Pods/Headers/Public/react-native-keep-awake\"\ \"/Users/jenkinsbuild/jenkins-dss/workspace/72_bip-meet_sprint6_upgradeBuild/ios/app/../Pods/Headers/Public/react-native-netinfo\"\ \"/Users/jenkinsbuild/jenkins-dss/workspace/72_bip-meet_sprint6_upgradeBuild/ios/app/../Pods/Headers/Public/react-native-safe-area-context\"\ \"/Users/jenkinsbuild/jenkins-dss/workspace/72_bip-meet_sprint6_upgradeBuild/ios/app/../Pods/Headers/Public/react-native-slider\"\ \"/Users/jenkinsbuild/jenkins-dss/workspace/72_bip-meet_sprint6_upgradeBuild/ios/app/../Pods/Headers/Public/react-native-splash-screen\"\ \"/Users/jenkinsbuild/jenkins-dss/workspace/72_bip-meet_sprint6_upgradeBuild/ios/app/../Pods/Headers/Public/react-native-video\"\ \"/Users/jenkinsbuild/jenkins-dss/workspace/72_bip-meet_sprint6_upgradeBuild/ios/app/../Pods/Headers/Public/react-native-webrtc\"\ \"/Users/jenkinsbuild/jenkins-dss/workspace/72_bip-meet_sprint6_upgradeBuild/ios/app/../Pods/Headers/Public/react-native-webview\"
12:25:39      export HIDE_BITCODE_SYMBOLS\=YES
12:25:39      export HOME\=/Users/jenkinsbuild
12:25:39      export ICONV\=/usr/bin/iconv
12:25:39      export INDEX_ENABLE_DATA_STORE\=NO
12:25:39      export INFOPLIST_EXPAND_BUILD_SETTINGS\=YES
12:25:39      export INFOPLIST_FILE\=src/Info.plist
12:25:39      export INFOPLIST_OUTPUT_FORMAT\=binary
12:25:39      export INFOPLIST_PATH\=jitsi-meet.app/Info.plist
12:25:39      export INFOPLIST_PREPROCESS\=NO
12:25:39      export INFOSTRINGS_PATH\=jitsi-meet.app/en.lproj/InfoPlist.strings
12:25:39      export INLINE_PRIVATE_FRAMEWORKS\=NO
12:25:39      export INSTALLHDRS_COPY_PHASE\=NO
12:25:39      export INSTALLHDRS_SCRIPT_PHASE\=NO
12:25:39      export INSTALL_DIR\=/Users/jenkinsbuild/Library/Developer/Xcode/DerivedData/jitsi-meet-hbqumcnhzlykisdvlutciopijbco/Build/Intermediates.noindex/ArchiveIntermediates/JitsiMeet/InstallationBuildProductsLocation/Applications
12:25:39      export INSTALL_GROUP\=1530679350
12:25:39      export INSTALL_MODE_FLAG\=u+w,go-w,a+rX
12:25:39      export INSTALL_OWNER\=jenkinsbuild
12:25:39      export INSTALL_PATH\=/Applications
12:25:39      export INSTALL_ROOT\=/Users/jenkinsbuild/Library/Developer/Xcode/DerivedData/jitsi-meet-hbqumcnhzlykisdvlutciopijbco/Build/Intermediates.noindex/ArchiveIntermediates/JitsiMeet/InstallationBuildProductsLocation
12:25:39      export IPHONEOS_DEPLOYMENT_TARGET\=11.0
12:25:39      export JAVAC_DEFAULT_FLAGS\=-J-Xms64m\ -J-XX:NewSize\=4M\ -J-Dfile.encoding\=UTF8
12:25:39      export JAVA_APP_STUB\=/System/Library/Frameworks/JavaVM.framework/Resources/MacOS/JavaApplicationStub
12:25:39      export JAVA_ARCHIVE_CLASSES\=YES
12:25:39      export JAVA_ARCHIVE_TYPE\=JAR
12:25:39      export JAVA_COMPILER\=/usr/bin/javac
12:25:39      export JAVA_FOLDER_PATH\=jitsi-meet.app/Java
12:25:39      export JAVA_FRAMEWORK_RESOURCES_DIRS\=Resources
12:25:39      export JAVA_JAR_FLAGS\=cv
12:25:39      export JAVA_SOURCE_SUBDIR\=.
12:25:39      export JAVA_USE_DEPENDENCIES\=YES
12:25:39      export JAVA_ZIP_FLAGS\=-urg
12:25:39      export JIKES_DEFAULT_FLAGS\=+E\ +OLDCSO
12:25:39      export KASAN_DEFAULT_CFLAGS\=-DKASAN\=1\ -fsanitize\=address\ -mllvm\ -asan-globals-live-support\ -mllvm\ -asan-force-dynamic-shadow
12:25:39      export KEEP_PRIVATE_EXTERNS\=NO
12:25:39      export LD_DEPENDENCY_INFO_FILE\=/Users/jenkinsbuild/Library/Developer/Xcode/DerivedData/jitsi-meet-hbqumcnhzlykisdvlutciopijbco/Build/Intermediates.noindex/ArchiveIntermediates/JitsiMeet/IntermediateBuildFilesPath/app.build/ReleaseEnt-iphoneos/JitsiMeet.build/Objects-normal/undefined_arch/jitsi-meet_dependency_info.dat
12:25:39      export LD_GENERATE_MAP_FILE\=NO
12:25:39      export LD_MAP_FILE_PATH\=/Users/jenkinsbuild/Library/Developer/Xcode/DerivedData/jitsi-meet-hbqumcnhzlykisdvlutciopijbco/Build/Intermediates.noindex/ArchiveIntermediates/JitsiMeet/IntermediateBuildFilesPath/app.build/ReleaseEnt-iphoneos/JitsiMeet.build/jitsi-meet-LinkMap-normal-undefined_arch.txt
12:25:39      export LD_NO_PIE\=NO
12:25:39      export LD_QUOTE_LINKER_ARGUMENTS_FOR_COMPILER_DRIVER\=YES
12:25:39      export LD_RUNPATH_SEARCH_PATHS\=\ @executable_path/Frameworks
12:25:39      export LEGACY_DEVELOPER_DIR\=/Applications/Xcode12.0.app/Contents/PlugIns/Xcode3Core.ideplugin/Contents/SharedSupport/Developer
12:25:39      export LEX\=lex
12:25:39      export LIBRARY_DEXT_INSTALL_PATH\=/Library/DriverExtensions
12:25:39      export LIBRARY_FLAG_NOSPACE\=YES
12:25:39      export LIBRARY_FLAG_PREFIX\=-l
12:25:39      export LIBRARY_KEXT_INSTALL_PATH\=/Library/Extensions
12:25:39      export LIBRARY_SEARCH_PATHS\=/Users/jenkinsbuild/jenkins-dss/workspace/72_bip-meet_sprint6_upgradeBuild/build/ReleaseEnt-iphoneos\ 
12:25:39      export LINKER_DISPLAYS_MANGLED_NAMES\=NO
12:25:39      export LINK_FILE_LIST_normal_arm64\=/Users/jenkinsbuild/Library/Developer/Xcode/DerivedData/jitsi-meet-hbqumcnhzlykisdvlutciopijbco/Build/Intermediates.noindex/ArchiveIntermediates/JitsiMeet/IntermediateBuildFilesPath/app.build/ReleaseEnt-iphoneos/JitsiMeet.build/Objects-normal/arm64/jitsi-meet.LinkFileList
12:25:39      export LINK_WITH_STANDARD_LIBRARIES\=YES
12:25:39      export LLVM_TARGET_TRIPLE_OS_VERSION\=ios11.0
12:25:39      export LLVM_TARGET_TRIPLE_VENDOR\=apple
12:25:39      export LOCALIZED_RESOURCES_FOLDER_PATH\=jitsi-meet.app/en.lproj
12:25:39      export LOCALIZED_STRING_MACRO_NAMES\=NSLocalizedString\ CFCopyLocalizedString
12:25:39      export LOCALIZED_STRING_SWIFTUI_SUPPORT\=YES
12:25:39      export LOCAL_ADMIN_APPS_DIR\=/Applications/Utilities
12:25:39      export LOCAL_APPS_DIR\=/Applications
12:25:39      export LOCAL_DEVELOPER_DIR\=/Library/Developer
12:25:39      export LOCAL_LIBRARY_DIR\=/Library
12:25:39      export LOCROOT\=/Users/jenkinsbuild/jenkins-dss/workspace/72_bip-meet_sprint6_upgradeBuild/ios/app
12:25:39      export LOCSYMROOT\=/Users/jenkinsbuild/jenkins-dss/workspace/72_bip-meet_sprint6_upgradeBuild/ios/app
12:25:39      export MACH_O_TYPE\=mh_execute
12:25:39      export MAC_OS_X_PRODUCT_BUILD_VERSION\=20G95
12:25:39      export MAC_OS_X_VERSION_ACTUAL\=110502
12:25:39      export MAC_OS_X_VERSION_MAJOR\=110500
12:25:39      export MAC_OS_X_VERSION_MINOR\=0502
12:25:39      export MARKETING_VERSION\=1.12.0
12:25:39      export MESSAGES_APPLICATION_EXTENSION_SUPPORT_FOLDER_PATH\=/Users/jenkinsbuild/Library/Developer/Xcode/DerivedData/jitsi-meet-hbqumcnhzlykisdvlutciopijbco/Build/Intermediates.noindex/ArchiveIntermediates/JitsiMeet/BuildProductsPath/MessagesApplicationExtensionSupport
12:25:39      export MESSAGES_APPLICATION_SUPPORT_FOLDER_PATH\=/Users/jenkinsbuild/Library/Developer/Xcode/DerivedData/jitsi-meet-hbqumcnhzlykisdvlutciopijbco/Build/Intermediates.noindex/ArchiveIntermediates/JitsiMeet/BuildProductsPath/MessagesApplicationSupport
12:25:39      export METAL_LIBRARY_FILE_BASE\=default
12:25:39      export METAL_LIBRARY_OUTPUT_DIR\=/Users/jenkinsbuild/Library/Developer/Xcode/DerivedData/jitsi-meet-hbqumcnhzlykisdvlutciopijbco/Build/Intermediates.noindex/ArchiveIntermediates/JitsiMeet/InstallationBuildProductsLocation/Applications/jitsi-meet.app
12:25:39      export MODULES_FOLDER_PATH\=jitsi-meet.app/Modules
12:25:39      export MODULE_CACHE_DIR\=/Users/jenkinsbuild/Library/Developer/Xcode/DerivedData/ModuleCache.noindex
12:25:39      export MTL_ENABLE_DEBUG_INFO\=NO
12:25:39      export NATIVE_ARCH\=armv7
12:25:39      export NATIVE_ARCH_32_BIT\=i386
12:25:39      export NATIVE_ARCH_64_BIT\=x86_64
12:25:39      export NATIVE_ARCH_ACTUAL\=x86_64
12:25:39      export NO_COMMON\=YES
12:25:39      export OBJECT_FILE_DIR\=/Users/jenkinsbuild/Library/Developer/Xcode/DerivedData/jitsi-meet-hbqumcnhzlykisdvlutciopijbco/Build/Intermediates.noindex/ArchiveIntermediates/JitsiMeet/IntermediateBuildFilesPath/app.build/ReleaseEnt-iphoneos/JitsiMeet.build/Objects
12:25:39      export OBJECT_FILE_DIR_normal\=/Users/jenkinsbuild/Library/Developer/Xcode/DerivedData/jitsi-meet-hbqumcnhzlykisdvlutciopijbco/Build/Intermediates.noindex/ArchiveIntermediates/JitsiMeet/IntermediateBuildFilesPath/app.build/ReleaseEnt-iphoneos/JitsiMeet.build/Objects-normal
12:25:39      export OBJROOT\=/Users/jenkinsbuild/Library/Developer/Xcode/DerivedData/jitsi-meet-hbqumcnhzlykisdvlutciopijbco/Build/Intermediates.noindex/ArchiveIntermediates/JitsiMeet/IntermediateBuildFilesPath
12:25:39      export ONLY_ACTIVE_ARCH\=NO
12:25:39      export OS\=MACOS
12:25:39      export OSAC\=/usr/bin/osacompile
12:25:39      export OTHER_LDFLAGS\=\ -ObjC\ -lc++
12:25:39      export PACKAGE_TYPE\=com.apple.package-type.wrapper.application
12:25:39      export PASCAL_STRINGS\=YES
12:25:39      export PATH\=/Applications/Xcode12.0.app/Contents/Developer/Toolchains/XcodeDefault.xctoolchain/usr/bin:/Applications/Xcode12.0.app/Contents/Developer/Toolchains/XcodeDefault.xctoolchain/usr/local/bin:/Applications/Xcode12.0.app/Contents/Developer/Toolchains/XcodeDefault.xctoolchain/usr/libexec:/Applications/Xcode12.0.app/Contents/Developer/Platforms/iPhoneOS.platform/usr/bin:/Applications/Xcode12.0.app/Contents/Developer/Platforms/iPhoneOS.platform/usr/local/bin:/Applications/Xcode12.0.app/Contents/Developer/Platforms/iPhoneOS.platform/Developer/usr/bin:/Applications/Xcode12.0.app/Contents/Developer/Platforms/iPhoneOS.platform/Developer/usr/local/bin:/Applications/Xcode12.0.app/Contents/Developer/usr/bin:/Applications/Xcode12.0.app/Contents/Developer/usr/local/bin:/usr/bin:/bin:/usr/sbin:/sbin
12:25:39      export PATH_PREFIXES_EXCLUDED_FROM_HEADER_DEPENDENCIES\=/usr/include\ /usr/local/include\ /System/Library/Frameworks\ /System/Library/PrivateFrameworks\ /Applications/Xcode12.0.app/Contents/Developer/Headers\ /Applications/Xcode12.0.app/Contents/Developer/SDKs\ /Applications/Xcode12.0.app/Contents/Developer/Platforms
12:25:39      export PBDEVELOPMENTPLIST_PATH\=jitsi-meet.app/pbdevelopment.plist
12:25:39      export PER_ARCH_OBJECT_FILE_DIR\=/Users/jenkinsbuild/Library/Developer/Xcode/DerivedData/jitsi-meet-hbqumcnhzlykisdvlutciopijbco/Build/Intermediates.noindex/ArchiveIntermediates/JitsiMeet/IntermediateBuildFilesPath/app.build/ReleaseEnt-iphoneos/JitsiMeet.build/Objects-normal/undefined_arch
12:25:39      export PER_VARIANT_OBJECT_FILE_DIR\=/Users/jenkinsbuild/Library/Developer/Xcode/DerivedData/jitsi-meet-hbqumcnhzlykisdvlutciopijbco/Build/Intermediates.noindex/ArchiveIntermediates/JitsiMeet/IntermediateBuildFilesPath/app.build/ReleaseEnt-iphoneos/JitsiMeet.build/Objects-normal
12:25:39      export PKGINFO_FILE_PATH\=/Users/jenkinsbuild/Library/Developer/Xcode/DerivedData/jitsi-meet-hbqumcnhzlykisdvlutciopijbco/Build/Intermediates.noindex/ArchiveIntermediates/JitsiMeet/IntermediateBuildFilesPath/app.build/ReleaseEnt-iphoneos/JitsiMeet.build/PkgInfo
12:25:39      export PKGINFO_PATH\=jitsi-meet.app/PkgInfo
12:25:39      export PLATFORM_DEVELOPER_APPLICATIONS_DIR\=/Applications/Xcode12.0.app/Contents/Developer/Platforms/iPhoneOS.platform/Developer/Applications
12:25:39      export PLATFORM_DEVELOPER_BIN_DIR\=/Applications/Xcode12.0.app/Contents/Developer/Platforms/iPhoneOS.platform/Developer/usr/bin
12:25:39      export PLATFORM_DEVELOPER_LIBRARY_DIR\=/Applications/Xcode12.0.app/Contents/Developer/Platforms/iPhoneOS.platform/Developer/Library
12:25:39      export PLATFORM_DEVELOPER_SDK_DIR\=/Applications/Xcode12.0.app/Contents/Developer/Platforms/iPhoneOS.platform/Developer/SDKs
12:25:39      export PLATFORM_DEVELOPER_TOOLS_DIR\=/Applications/Xcode12.0.app/Contents/Developer/Platforms/iPhoneOS.platform/Developer/Tools
12:25:39      export PLATFORM_DEVELOPER_USR_DIR\=/Applications/Xcode12.0.app/Contents/Developer/Platforms/iPhoneOS.platform/Developer/usr
12:25:39      export PLATFORM_DIR\=/Applications/Xcode12.0.app/Contents/Developer/Platforms/iPhoneOS.platform
12:25:39      export PLATFORM_DISPLAY_NAME\=iOS
12:25:39      export PLATFORM_FAMILY_NAME\=iOS
12:25:39      export PLATFORM_NAME\=iphoneos
12:25:39      export PLATFORM_PREFERRED_ARCH\=arm64
12:25:39      export PLATFORM_PRODUCT_BUILD_VERSION\=18A390
12:25:39      export PLIST_FILE_OUTPUT_FORMAT\=binary
12:25:39      export PLUGINS_FOLDER_PATH\=jitsi-meet.app/PlugIns
12:25:39      export PODS_BUILD_DIR\=/Users/jenkinsbuild/jenkins-dss/workspace/72_bip-meet_sprint6_upgradeBuild/build
12:25:39      export PODS_CONFIGURATION_BUILD_DIR\=/Users/jenkinsbuild/jenkins-dss/workspace/72_bip-meet_sprint6_upgradeBuild/build/ReleaseEnt-iphoneos
12:25:39      export PODS_PODFILE_DIR_PATH\=/Users/jenkinsbuild/jenkins-dss/workspace/72_bip-meet_sprint6_upgradeBuild/ios/app/..
12:25:39      export PODS_ROOT\=/Users/jenkinsbuild/jenkins-dss/workspace/72_bip-meet_sprint6_upgradeBuild/ios/app/../Pods
12:25:39      export PODS_XCFRAMEWORKS_BUILD_DIR\=/Users/jenkinsbuild/jenkins-dss/workspace/72_bip-meet_sprint6_upgradeBuild/build/ReleaseEnt-iphoneos/XCFrameworkIntermediates
12:25:39      export PRECOMPS_INCLUDE_HEADERS_FROM_BUILT_PRODUCTS_DIR\=YES
12:25:39      export PRECOMP_DESTINATION_DIR\=/Users/jenkinsbuild/Library/Developer/Xcode/DerivedData/jitsi-meet-hbqumcnhzlykisdvlutciopijbco/Build/Intermediates.noindex/ArchiveIntermediates/JitsiMeet/IntermediateBuildFilesPath/app.build/ReleaseEnt-iphoneos/JitsiMeet.build/PrefixHeaders
12:25:39      export PRESERVE_DEAD_CODE_INITS_AND_TERMS\=NO
12:25:39      export PRIVATE_HEADERS_FOLDER_PATH\=jitsi-meet.app/PrivateHeaders
12:25:39      export PRODUCT_BUNDLE_IDENTIFIER\=com.turkcell.bipmeetent
12:25:39      export PRODUCT_BUNDLE_PACKAGE_TYPE\=APPL
12:25:39      export PRODUCT_MODULE_NAME\=jitsi_meet
12:25:39      export PRODUCT_NAME\=jitsi-meet
12:25:39      export PRODUCT_SETTINGS_PATH\=/Users/jenkinsbuild/jenkins-dss/workspace/72_bip-meet_sprint6_upgradeBuild/ios/app/src/Info.plist
12:25:39      export PRODUCT_TYPE\=com.apple.product-type.application
12:25:39      export PROFILING_CODE\=NO
12:25:39      export PROJECT\=app
12:25:39      export PROJECT_DERIVED_FILE_DIR\=/Users/jenkinsbuild/Library/Developer/Xcode/DerivedData/jitsi-meet-hbqumcnhzlykisdvlutciopijbco/Build/Intermediates.noindex/ArchiveIntermediates/JitsiMeet/IntermediateBuildFilesPath/app.build/DerivedSources
12:25:39      export PROJECT_DIR\=/Users/jenkinsbuild/jenkins-dss/workspace/72_bip-meet_sprint6_upgradeBuild/ios/app
12:25:39      export PROJECT_FILE_PATH\=/Users/jenkinsbuild/jenkins-dss/workspace/72_bip-meet_sprint6_upgradeBuild/ios/app/app.xcodeproj
12:25:39      export PROJECT_NAME\=app
12:25:39      export PROJECT_TEMP_DIR\=/Users/jenkinsbuild/Library/Developer/Xcode/DerivedData/jitsi-meet-hbqumcnhzlykisdvlutciopijbco/Build/Intermediates.noindex/ArchiveIntermediates/JitsiMeet/IntermediateBuildFilesPath/app.build
12:25:39      export PROJECT_TEMP_ROOT\=/Users/jenkinsbuild/Library/Developer/Xcode/DerivedData/jitsi-meet-hbqumcnhzlykisdvlutciopijbco/Build/Intermediates.noindex/ArchiveIntermediates/JitsiMeet/IntermediateBuildFilesPath
12:25:39      export PROVISIONING_PROFILE_REQUIRED\=YES
12:25:39      export PROVISIONING_PROFILE_SPECIFIER\=bipmeet\ enterprise
12:25:39      export PUBLIC_HEADERS_FOLDER_PATH\=jitsi-meet.app/Headers
12:25:39      export RECURSIVE_SEARCH_PATHS_FOLLOW_SYMLINKS\=YES
12:25:39      export REMOVE_CVS_FROM_RESOURCES\=YES
12:25:39      export REMOVE_GIT_FROM_RESOURCES\=YES
12:25:39      export REMOVE_HEADERS_FROM_EMBEDDED_BUNDLES\=YES
12:25:39      export REMOVE_HG_FROM_RESOURCES\=YES
12:25:39      export REMOVE_SVN_FROM_RESOURCES\=YES
12:25:39      export RESOURCE_RULES_REQUIRED\=YES
12:25:39      export REZ_COLLECTOR_DIR\=/Users/jenkinsbuild/Library/Developer/Xcode/DerivedData/jitsi-meet-hbqumcnhzlykisdvlutciopijbco/Build/Intermediates.noindex/ArchiveIntermediates/JitsiMeet/IntermediateBuildFilesPath/app.build/ReleaseEnt-iphoneos/JitsiMeet.build/ResourceManagerResources
12:25:39      export REZ_OBJECTS_DIR\=/Users/jenkinsbuild/Library/Developer/Xcode/DerivedData/jitsi-meet-hbqumcnhzlykisdvlutciopijbco/Build/Intermediates.noindex/ArchiveIntermediates/JitsiMeet/IntermediateBuildFilesPath/app.build/ReleaseEnt-iphoneos/JitsiMeet.build/ResourceManagerResources/Objects
12:25:39      export REZ_SEARCH_PATHS\=/Users/jenkinsbuild/jenkins-dss/workspace/72_bip-meet_sprint6_upgradeBuild/build/ReleaseEnt-iphoneos\ 
12:25:39      export SCAN_ALL_SOURCE_FILES_FOR_INCLUDES\=NO
12:25:39      export SCRIPTS_FOLDER_PATH\=jitsi-meet.app/Scripts
12:25:39      export SCRIPT_INPUT_FILE_COUNT\=0
12:25:39      export SCRIPT_INPUT_FILE_LIST_COUNT\=0
12:25:39      export SCRIPT_OUTPUT_FILE_COUNT\=0
12:25:39      export SCRIPT_OUTPUT_FILE_LIST_COUNT\=0
12:25:39      export SDKROOT\=/Applications/Xcode12.0.app/Contents/Developer/Platforms/iPhoneOS.platform/Developer/SDKs/iPhoneOS14.0.sdk
12:25:39      export SDK_DIR\=/Applications/Xcode12.0.app/Contents/Developer/Platforms/iPhoneOS.platform/Developer/SDKs/iPhoneOS14.0.sdk
12:25:39      export SDK_DIR_iphoneos14_0\=/Applications/Xcode12.0.app/Contents/Developer/Platforms/iPhoneOS.platform/Developer/SDKs/iPhoneOS14.0.sdk
12:25:39      export SDK_NAME\=iphoneos14.0
12:25:39      export SDK_NAMES\=iphoneos14.0
12:25:39      export SDK_PRODUCT_BUILD_VERSION\=18A390
12:25:39      export SDK_VERSION\=14.0
12:25:39      export SDK_VERSION_ACTUAL\=140000
12:25:39      export SDK_VERSION_MAJOR\=140000
12:25:39      export SDK_VERSION_MINOR\=000
12:25:39      export SED\=/usr/bin/sed
12:25:39      export SEPARATE_STRIP\=NO
12:25:39      export SEPARATE_SYMBOL_EDIT\=NO
12:25:39      export SET_DIR_MODE_OWNER_GROUP\=YES
12:25:39      export SET_FILE_MODE_OWNER_GROUP\=NO
12:25:39      export SHALLOW_BUNDLE\=YES
12:25:39      export SHARED_DERIVED_FILE_DIR\=/Users/jenkinsbuild/jenkins-dss/workspace/72_bip-meet_sprint6_upgradeBuild/build/ReleaseEnt-iphoneos/DerivedSources
12:25:39      export SHARED_FRAMEWORKS_FOLDER_PATH\=jitsi-meet.app/SharedFrameworks
12:25:39      export SHARED_PRECOMPS_DIR\=/Users/jenkinsbuild/Library/Developer/Xcode/DerivedData/jitsi-meet-hbqumcnhzlykisdvlutciopijbco/Build/Intermediates.noindex/ArchiveIntermediates/JitsiMeet/PrecompiledHeaders
12:25:39      export SHARED_SUPPORT_FOLDER_PATH\=jitsi-meet.app/SharedSupport
12:25:39      export SKIP_INSTALL\=NO
12:25:39      export SOURCE_ROOT\=/Users/jenkinsbuild/jenkins-dss/workspace/72_bip-meet_sprint6_upgradeBuild/ios/app
12:25:39      export SRCROOT\=/Users/jenkinsbuild/jenkins-dss/workspace/72_bip-meet_sprint6_upgradeBuild/ios/app
12:25:39      export STRINGS_FILE_OUTPUT_ENCODING\=binary
12:25:39      export STRIP_BITCODE_FROM_COPIED_FILES\=YES
12:25:39      export STRIP_INSTALLED_PRODUCT\=YES
12:25:39      export STRIP_STYLE\=all
12:25:39      export STRIP_SWIFT_SYMBOLS\=YES
12:25:39      export SUPPORTED_DEVICE_FAMILIES\=1,2
12:25:39      export SUPPORTED_PLATFORMS\=iphoneos\ iphonesimulator
12:25:39      export SUPPORTS_MACCATALYST\=NO
12:25:39      export SUPPORTS_MAC_DESIGNED_FOR_IPHONE_IPAD\=YES
12:25:39      export SUPPORTS_TEXT_BASED_API\=NO
12:25:39      export SWIFT_COMPILATION_MODE\=wholemodule
12:25:39      export SWIFT_PLATFORM_TARGET_PREFIX\=ios
12:25:39      export SWIFT_RESPONSE_FILE_PATH_normal_arm64\=/Users/jenkinsbuild/Library/Developer/Xcode/DerivedData/jitsi-meet-hbqumcnhzlykisdvlutciopijbco/Build/Intermediates.noindex/ArchiveIntermediates/JitsiMeet/IntermediateBuildFilesPath/app.build/ReleaseEnt-iphoneos/JitsiMeet.build/Objects-normal/arm64/jitsi-meet.SwiftFileList
12:25:39      export SWIFT_STDLIB_TOOL_UNSIGNED_DESTINATION_DIR\=/Users/jenkinsbuild/Library/Developer/Xcode/DerivedData/jitsi-meet-hbqumcnhzlykisdvlutciopijbco/Build/Intermediates.noindex/ArchiveIntermediates/JitsiMeet/BuildProductsPath/SwiftSupport
12:25:39      export SWIFT_VERSION\=5.0
12:25:39      export SYMROOT\=/Users/jenkinsbuild/Library/Developer/Xcode/DerivedData/jitsi-meet-hbqumcnhzlykisdvlutciopijbco/Build/Intermediates.noindex/ArchiveIntermediates/JitsiMeet/BuildProductsPath
12:25:39      export SYSTEM_ADMIN_APPS_DIR\=/Applications/Utilities
12:25:39      export SYSTEM_APPS_DIR\=/Applications
12:25:39      export SYSTEM_CORE_SERVICES_DIR\=/System/Library/CoreServices
12:25:39      export SYSTEM_DEMOS_DIR\=/Applications/Extras
12:25:39      export SYSTEM_DEVELOPER_APPS_DIR\=/Applications/Xcode12.0.app/Contents/Developer/Applications
12:25:39      export SYSTEM_DEVELOPER_BIN_DIR\=/Applications/Xcode12.0.app/Contents/Developer/usr/bin
12:25:39      export SYSTEM_DEVELOPER_DEMOS_DIR\=/Applications/Xcode12.0.app/Contents/Developer/Applications/Utilities/Built\ Examples
12:25:39      export SYSTEM_DEVELOPER_DIR\=/Applications/Xcode12.0.app/Contents/Developer
12:25:39      export SYSTEM_DEVELOPER_DOC_DIR\=/Applications/Xcode12.0.app/Contents/Developer/ADC\ Reference\ Library
12:25:39      export SYSTEM_DEVELOPER_GRAPHICS_TOOLS_DIR\=/Applications/Xcode12.0.app/Contents/Developer/Applications/Graphics\ Tools
12:25:39      export SYSTEM_DEVELOPER_JAVA_TOOLS_DIR\=/Applications/Xcode12.0.app/Contents/Developer/Applications/Java\ Tools
12:25:39      export SYSTEM_DEVELOPER_PERFORMANCE_TOOLS_DIR\=/Applications/Xcode12.0.app/Contents/Developer/Applications/Performance\ Tools
12:25:39      export SYSTEM_DEVELOPER_RELEASENOTES_DIR\=/Applications/Xcode12.0.app/Contents/Developer/ADC\ Reference\ Library/releasenotes
12:25:39      export SYSTEM_DEVELOPER_TOOLS\=/Applications/Xcode12.0.app/Contents/Developer/Tools
12:25:39      export SYSTEM_DEVELOPER_TOOLS_DOC_DIR\=/Applications/Xcode12.0.app/Contents/Developer/ADC\ Reference\ Library/documentation/DeveloperTools
12:25:39      export SYSTEM_DEVELOPER_TOOLS_RELEASENOTES_DIR\=/Applications/Xcode12.0.app/Contents/Developer/ADC\ Reference\ Library/releasenotes/DeveloperTools
12:25:39      export SYSTEM_DEVELOPER_USR_DIR\=/Applications/Xcode12.0.app/Contents/Developer/usr
12:25:39      export SYSTEM_DEVELOPER_UTILITIES_DIR\=/Applications/Xcode12.0.app/Contents/Developer/Applications/Utilities
12:25:39      export SYSTEM_DEXT_INSTALL_PATH\=/System/Library/DriverExtensions
12:25:39      export SYSTEM_DOCUMENTATION_DIR\=/Library/Documentation
12:25:39      export SYSTEM_KEXT_INSTALL_PATH\=/System/Library/Extensions
12:25:39      export SYSTEM_LIBRARY_DIR\=/System/Library
12:25:39      export TAPI_VERIFY_MODE\=ErrorsOnly
12:25:39      export TARGETED_DEVICE_FAMILY\=1,2
12:25:39      export TARGETNAME\=JitsiMeet
12:25:39      export TARGET_BUILD_DIR\=/Users/jenkinsbuild/Library/Developer/Xcode/DerivedData/jitsi-meet-hbqumcnhzlykisdvlutciopijbco/Build/Intermediates.noindex/ArchiveIntermediates/JitsiMeet/InstallationBuildProductsLocation/Applications
12:25:39      export TARGET_NAME\=JitsiMeet
12:25:39      export TARGET_TEMP_DIR\=/Users/jenkinsbuild/Library/Developer/Xcode/DerivedData/jitsi-meet-hbqumcnhzlykisdvlutciopijbco/Build/Intermediates.noindex/ArchiveIntermediates/JitsiMeet/IntermediateBuildFilesPath/app.build/ReleaseEnt-iphoneos/JitsiMeet.build
12:25:39      export TEMP_DIR\=/Users/jenkinsbuild/Library/Developer/Xcode/DerivedData/jitsi-meet-hbqumcnhzlykisdvlutciopijbco/Build/Intermediates.noindex/ArchiveIntermediates/JitsiMeet/IntermediateBuildFilesPath/app.build/ReleaseEnt-iphoneos/JitsiMeet.build
12:25:39      export TEMP_FILES_DIR\=/Users/jenkinsbuild/Library/Developer/Xcode/DerivedData/jitsi-meet-hbqumcnhzlykisdvlutciopijbco/Build/Intermediates.noindex/ArchiveIntermediates/JitsiMeet/IntermediateBuildFilesPath/app.build/ReleaseEnt-iphoneos/JitsiMeet.build
12:25:39      export TEMP_FILE_DIR\=/Users/jenkinsbuild/Library/Developer/Xcode/DerivedData/jitsi-meet-hbqumcnhzlykisdvlutciopijbco/Build/Intermediates.noindex/ArchiveIntermediates/JitsiMeet/IntermediateBuildFilesPath/app.build/ReleaseEnt-iphoneos/JitsiMeet.build
12:25:39      export TEMP_ROOT\=/Users/jenkinsbuild/Library/Developer/Xcode/DerivedData/jitsi-meet-hbqumcnhzlykisdvlutciopijbco/Build/Intermediates.noindex/ArchiveIntermediates/JitsiMeet/IntermediateBuildFilesPath
12:25:39      export TEST_FRAMEWORK_SEARCH_PATHS\=\ /Applications/Xcode12.0.app/Contents/Developer/Platforms/iPhoneOS.platform/Developer/Library/Frameworks\ /Applications/Xcode12.0.app/Contents/Developer/Platforms/iPhoneOS.platform/Developer/SDKs/iPhoneOS14.0.sdk/Developer/Library/Frameworks
12:25:39      export TEST_LIBRARY_SEARCH_PATHS\=\ /Applications/Xcode12.0.app/Contents/Developer/Platforms/iPhoneOS.platform/Developer/usr/lib
12:25:39      export TOOLCHAINS\=com.apple.dt.toolchain.XcodeDefault
12:25:39      export TOOLCHAIN_DIR\=/Applications/Xcode12.0.app/Contents/Developer/Toolchains/XcodeDefault.xctoolchain
12:25:39      export TREAT_MISSING_BASELINES_AS_TEST_FAILURES\=NO
12:25:39      export TeamIdentifierPrefix\=LA4DZFY7SY.
12:25:39      export UID\=1449894741
12:25:39      export UNLOCALIZED_RESOURCES_FOLDER_PATH\=jitsi-meet.app
12:25:39      export UNSTRIPPED_PRODUCT\=NO
12:25:39      export USER\=jenkinsbuild
12:25:39      export USER_APPS_DIR\=/Users/jenkinsbuild/Applications
12:25:39      export USER_LIBRARY_DIR\=/Users/jenkinsbuild/Library
12:25:39      export USE_DYNAMIC_NO_PIC\=YES
12:25:39      export USE_HEADERMAP\=YES
12:25:39      export USE_HEADER_SYMLINKS\=NO
12:25:39      export USE_LLVM_TARGET_TRIPLES\=YES
12:25:39      export USE_LLVM_TARGET_TRIPLES_FOR_CLANG\=YES
12:25:39      export USE_LLVM_TARGET_TRIPLES_FOR_LD\=YES
12:25:39      export USE_LLVM_TARGET_TRIPLES_FOR_TAPI\=YES
12:25:39      export USE_RECURSIVE_SCRIPT_INPUTS_IN_SCRIPT_PHASES\=YES
12:25:39      export VALIDATE_DEVELOPMENT_ASSET_PATHS\=YES_ERROR
12:25:39      export VALIDATE_PRODUCT\=YES
12:25:39      export VALIDATE_WORKSPACE\=YES_ERROR
12:25:39      export VALID_ARCHS\=arm64\ arm64e\ armv7\ armv7s
12:25:39      export VERBOSE_PBXCP\=NO
12:25:39      export VERSIONPLIST_PATH\=jitsi-meet.app/version.plist
12:25:39      export VERSION_INFO_BUILDER\=jenkinsbuild
12:25:39      export VERSION_INFO_FILE\=jitsi-meet_vers.c
12:25:39      export VERSION_INFO_STRING\=\"@\(\#\)PROGRAM:jitsi-meet\ \ PROJECT:app-1\"
12:25:39      export WATCHKIT_2_SUPPORT_FOLDER_PATH\=/Users/jenkinsbuild/Library/Developer/Xcode/DerivedData/jitsi-meet-hbqumcnhzlykisdvlutciopijbco/Build/Intermediates.noindex/ArchiveIntermediates/JitsiMeet/BuildProductsPath/WatchKitSupport2
12:25:39      export WATCHKIT_SUPPORT_FOLDER_PATH\=/Users/jenkinsbuild/Library/Developer/Xcode/DerivedData/jitsi-meet-hbqumcnhzlykisdvlutciopijbco/Build/Intermediates.noindex/ArchiveIntermediates/JitsiMeet/BuildProductsPath/WatchKitSupport
12:25:39      export WRAPPER_EXTENSION\=app
12:25:39      export WRAPPER_NAME\=jitsi-meet.app
12:25:39      export WRAPPER_SUFFIX\=.app
12:25:39      export WRAP_ASSET_PACKS_IN_SEPARATE_DIRECTORIES\=NO
12:25:39      export XCODE_APP_SUPPORT_DIR\=/Applications/Xcode12.0.app/Contents/Developer/Library/Xcode
12:25:39      export XCODE_PRODUCT_BUILD_VERSION\=12A7209
12:25:39      export XCODE_VERSION_ACTUAL\=1200
12:25:39      export XCODE_VERSION_MAJOR\=1200
12:25:39      export XCODE_VERSION_MINOR\=1200
12:25:39      export XPCSERVICES_FOLDER_PATH\=jitsi-meet.app/XPCServices
12:25:39      export YACC\=yacc
12:25:39      export arch\=undefined_arch
12:25:39      export variant\=normal
12:25:39      /bin/sh -c /Users/jenkinsbuild/Library/Developer/Xcode/DerivedData/jitsi-meet-hbqumcnhzlykisdvlutciopijbco/Build/Intermediates.noindex/ArchiveIntermediates/JitsiMeet/IntermediateBuildFilesPath/app.build/ReleaseEnt-iphoneos/JitsiMeet.build/Script-DE4F6D6E22005C0400DE699E.sh
12:25:39  
12:25:39  PBXCp /Users/jenkinsbuild/jenkins-dss/workspace/72_bip-meet_sprint6_upgradeBuild/build/ReleaseEnt-watchos/JitsiMeetCompanion.app /Users/jenkinsbuild/jenkins-dss/workspace/72_bip-meet_sprint6_upgradeBuild/build/ReleaseEnt-iphoneos/jitsi-meet.app/Watch/JitsiMeetCompanion.app (in target 'JitsiMeet' from project 'app')
12:25:39      cd /Users/jenkinsbuild/jenkins-dss/workspace/72_bip-meet_sprint6_upgradeBuild/ios/app
12:25:39      builtin-copy -exclude .DS_Store -exclude CVS -exclude .svn -exclude .git -exclude .hg -strip-debug-symbols -strip-tool /Applications/Xcode12.0.app/Contents/Developer/Toolchains/XcodeDefault.xctoolchain/usr/bin/strip -resolve-src-symlinks /Users/jenkinsbuild/jenkins-dss/workspace/72_bip-meet_sprint6_upgradeBuild/build/ReleaseEnt-watchos/JitsiMeetCompanion.app /Users/jenkinsbuild/jenkins-dss/workspace/72_bip-meet_sprint6_upgradeBuild/build/ReleaseEnt-iphoneos/jitsi-meet.app/Watch
12:25:39  warning: skipping copy phase strip, binary is code signed: /Users/jenkinsbuild/Library/Developer/Xcode/DerivedData/jitsi-meet-hbqumcnhzlykisdvlutciopijbco/Build/Intermediates.noindex/ArchiveIntermediates/JitsiMeet/IntermediateBuildFilesPath/UninstalledProducts/watchos/JitsiMeetCompanion.app/PlugIns/JitsiMeetCompanion Extension.appex/JitsiMeetCompanion Extension (in target 'JitsiMeet' from project 'app')
12:25:39  warning: skipping copy phase strip, binary is code signed: /Users/jenkinsbuild/Library/Developer/Xcode/DerivedData/jitsi-meet-hbqumcnhzlykisdvlutciopijbco/Build/Intermediates.noindex/ArchiveIntermediates/JitsiMeet/IntermediateBuildFilesPath/UninstalledProducts/watchos/JitsiMeetCompanion.app/JitsiMeetCompanion (in target 'JitsiMeet' from project 'app')
12:25:39  warning: skipping copy phase strip, binary is code signed: /Users/jenkinsbuild/Library/Developer/Xcode/DerivedData/jitsi-meet-hbqumcnhzlykisdvlutciopijbco/Build/Intermediates.noindex/ArchiveIntermediates/JitsiMeet/IntermediateBuildFilesPath/UninstalledProducts/watchos/JitsiMeetCompanion.app/_WatchKitStub/WK (in target 'JitsiMeet' from project 'app')
12:25:39  warning: skipping copy phase strip, binary is code signed: /Users/jenkinsbuild/Library/Developer/Xcode/DerivedData/jitsi-meet-hbqumcnhzlykisdvlutciopijbco/Build/Intermediates.noindex/ArchiveIntermediates/JitsiMeet/IntermediateBuildFilesPath/UninstalledProducts/watchos/JitsiMeetCompanion.app/Frameworks/libswiftMapKit.dylib (in target 'JitsiMeet' from project 'app')
12:25:39  warning: skipping copy phase strip, binary is code signed: /Users/jenkinsbuild/Library/Developer/Xcode/DerivedData/jitsi-meet-hbqumcnhzlykisdvlutciopijbco/Build/Intermediates.noindex/ArchiveIntermediates/JitsiMeet/IntermediateBuildFilesPath/UninstalledProducts/watchos/JitsiMeetCompanion.app/Frameworks/libswiftSceneKit.dylib (in target 'JitsiMeet' from project 'app')
12:25:39  warning: skipping copy phase strip, binary is code signed: /Users/jenkinsbuild/Library/Developer/Xcode/DerivedData/jitsi-meet-hbqumcnhzlykisdvlutciopijbco/Build/Intermediates.noindex/ArchiveIntermediates/JitsiMeet/IntermediateBuildFilesPath/UninstalledProducts/watchos/JitsiMeetCompanion.app/Frameworks/libswiftObjectiveC.dylib (in target 'JitsiMeet' from project 'app')
12:25:39  warning: skipping copy phase strip, binary is code signed: /Users/jenkinsbuild/Library/Developer/Xcode/DerivedData/jitsi-meet-hbqumcnhzlykisdvlutciopijbco/Build/Intermediates.noindex/ArchiveIntermediates/JitsiMeet/IntermediateBuildFilesPath/UninstalledProducts/watchos/JitsiMeetCompanion.app/Frameworks/libswiftWatchKit.dylib (in target 'JitsiMeet' from project 'app')
12:25:39  warning: skipping copy phase strip, binary is code signed: /Users/jenkinsbuild/Library/Developer/Xcode/DerivedData/jitsi-meet-hbqumcnhzlykisdvlutciopijbco/Build/Intermediates.noindex/ArchiveIntermediates/JitsiMeet/IntermediateBuildFilesPath/UninstalledProducts/watchos/JitsiMeetCompanion.app/Frameworks/libswiftCore.dylib (in target 'JitsiMeet' from project 'app')
12:25:39  warning: skipping copy phase strip, binary is code signed: /Users/jenkinsbuild/Library/Developer/Xcode/DerivedData/jitsi-meet-hbqumcnhzlykisdvlutciopijbco/Build/Intermediates.noindex/ArchiveIntermediates/JitsiMeet/IntermediateBuildFilesPath/UninstalledProducts/watchos/JitsiMeetCompanion.app/Frameworks/libswiftCoreGraphics.dylib (in target 'JitsiMeet' from project 'app')
12:25:39  warning: skipping copy phase strip, binary is code signed: /Users/jenkinsbuild/Library/Developer/Xcode/DerivedData/jitsi-meet-hbqumcnhzlykisdvlutciopijbco/Build/Intermediates.noindex/ArchiveIntermediates/JitsiMeet/IntermediateBuildFilesPath/UninstalledProducts/watchos/JitsiMeetCompanion.app/Frameworks/libswiftUIKit.dylib (in target 'JitsiMeet' from project 'app')
12:25:39  warning: skipping copy phase strip, binary is code signed: /Users/jenkinsbuild/Library/Developer/Xcode/DerivedData/jitsi-meet-hbqumcnhzlykisdvlutciopijbco/Build/Intermediates.noindex/ArchiveIntermediates/JitsiMeet/IntermediateBuildFilesPath/UninstalledProducts/watchos/JitsiMeetCompanion.app/Frameworks/libswiftDispatch.dylib (in target 'JitsiMeet' from project 'app')
12:25:39  warning: skipping copy phase strip, binary is code signed: /Users/jenkinsbuild/Library/Developer/Xcode/DerivedData/jitsi-meet-hbqumcnhzlykisdvlutciopijbco/Build/Intermediates.noindex/ArchiveIntermediates/JitsiMeet/IntermediateBuildFilesPath/UninstalledProducts/watchos/JitsiMeetCompanion.app/Frameworks/libswiftCoreFoundation.dylib (in target 'JitsiMeet' from project 'app')
12:25:39  warning: skipping copy phase strip, binary is code signed: /Users/jenkinsbuild/Library/Developer/Xcode/DerivedData/jitsi-meet-hbqumcnhzlykisdvlutciopijbco/Build/Intermediates.noindex/ArchiveIntermediates/JitsiMeet/IntermediateBuildFilesPath/UninstalledProducts/watchos/JitsiMeetCompanion.app/Frameworks/libswiftDarwin.dylib (in target 'JitsiMeet' from project 'app')
12:25:39  warning: skipping copy phase strip, binary is code signed: /Users/jenkinsbuild/Library/Developer/Xcode/DerivedData/jitsi-meet-hbqumcnhzlykisdvlutciopijbco/Build/Intermediates.noindex/ArchiveIntermediates/JitsiMeet/IntermediateBuildFilesPath/UninstalledProducts/watchos/JitsiMeetCompanion.app/Frameworks/libswiftHomeKit.dylib (in target 'JitsiMeet' from project 'app')
12:25:39  warning: skipping copy phase strip, binary is code signed: /Users/jenkinsbuild/Library/Developer/Xcode/DerivedData/jitsi-meet-hbqumcnhzlykisdvlutciopijbco/Build/Intermediates.noindex/ArchiveIntermediates/JitsiMeet/IntermediateBuildFilesPath/UninstalledProducts/watchos/JitsiMeetCompanion.app/Frameworks/libswiftFoundation.dylib (in target 'JitsiMeet' from project 'app')
12:25:39  warning: skipping copy phase strip, binary is code signed: /Users/jenkinsbuild/Library/Developer/Xcode/DerivedData/jitsi-meet-hbqumcnhzlykisdvlutciopijbco/Build/Intermediates.noindex/ArchiveIntermediates/JitsiMeet/IntermediateBuildFilesPath/UninstalledProducts/watchos/JitsiMeetCompanion.app/Frameworks/libswiftCoreLocation.dylib (in target 'JitsiMeet' from project 'app')
12:25:39  warning: skipping copy phase strip, binary is code signed: /Users/jenkinsbuild/Library/Developer/Xcode/DerivedData/jitsi-meet-hbqumcnhzlykisdvlutciopijbco/Build/Intermediates.noindex/ArchiveIntermediates/JitsiMeet/IntermediateBuildFilesPath/UninstalledProducts/watchos/JitsiMeetCompanion.app/Frameworks/libswiftsimd.dylib (in target 'JitsiMeet' from project 'app')
12:25:39  
12:25:39  PBXCp /Users/jenkinsbuild/jenkins-dss/workspace/72_bip-meet_sprint6_upgradeBuild/build/ReleaseEnt-iphoneos/JitsiMeetBroadcast\ Extension.appex /Users/jenkinsbuild/Library/Developer/Xcode/DerivedData/jitsi-meet-hbqumcnhzlykisdvlutciopijbco/Build/Intermediates.noindex/ArchiveIntermediates/JitsiMeet/InstallationBuildProductsLocation/Applications/jitsi-meet.app/PlugIns/JitsiMeetBroadcast\ Extension.appex (in target 'JitsiMeet' from project 'app')
12:25:39      cd /Users/jenkinsbuild/jenkins-dss/workspace/72_bip-meet_sprint6_upgradeBuild/ios/app
12:25:39      builtin-copy -exclude .DS_Store -exclude CVS -exclude .svn -exclude .git -exclude .hg -exclude Headers -exclude PrivateHeaders -exclude Modules -exclude \*.tbd -strip-debug-symbols -strip-tool /Applications/Xcode12.0.app/Contents/Developer/Toolchains/XcodeDefault.xctoolchain/usr/bin/strip -resolve-src-symlinks /Users/jenkinsbuild/jenkins-dss/workspace/72_bip-meet_sprint6_upgradeBuild/build/ReleaseEnt-iphoneos/JitsiMeetBroadcast\ Extension.appex /Users/jenkinsbuild/Library/Developer/Xcode/DerivedData/jitsi-meet-hbqumcnhzlykisdvlutciopijbco/Build/Intermediates.noindex/ArchiveIntermediates/JitsiMeet/InstallationBuildProductsLocation/Applications/jitsi-meet.app/PlugIns
12:25:39  warning: skipping copy phase strip, binary is code signed: /Users/jenkinsbuild/Library/Developer/Xcode/DerivedData/jitsi-meet-hbqumcnhzlykisdvlutciopijbco/Build/Intermediates.noindex/ArchiveIntermediates/JitsiMeet/IntermediateBuildFilesPath/UninstalledProducts/iphoneos/JitsiMeetBroadcast Extension.appex/JitsiMeetBroadcast Extension (in target 'JitsiMeet' from project 'app')
12:25:39  
12:25:39  CopySwiftLibs /Users/jenkinsbuild/Library/Developer/Xcode/DerivedData/jitsi-meet-hbqumcnhzlykisdvlutciopijbco/Build/Intermediates.noindex/ArchiveIntermediates/JitsiMeet/InstallationBuildProductsLocation/Applications/jitsi-meet.app (in target 'JitsiMeet' from project 'app')
12:25:39      cd /Users/jenkinsbuild/jenkins-dss/workspace/72_bip-meet_sprint6_upgradeBuild/ios/app
12:25:39      export CODESIGN_ALLOCATE\=/Applications/Xcode12.0.app/Contents/Developer/Toolchains/XcodeDefault.xctoolchain/usr/bin/codesign_allocate
12:25:39      export DEVELOPER_DIR\=/Applications/Xcode12.0.app/Contents/Developer
12:25:39      export SDKROOT\=/Applications/Xcode12.0.app/Contents/Developer/Platforms/iPhoneOS.platform/Developer/SDKs/iPhoneOS14.0.sdk
12:25:39      builtin-swiftStdLibTool --copy --verbose --sign 571934C617E6AA93AABFC534D5B2EB0A68629D95 --scan-executable /Users/jenkinsbuild/Library/Developer/Xcode/DerivedData/jitsi-meet-hbqumcnhzlykisdvlutciopijbco/Build/Intermediates.noindex/ArchiveIntermediates/JitsiMeet/InstallationBuildProductsLocation/Applications/jitsi-meet.app/jitsi-meet --scan-folder /Users/jenkinsbuild/Library/Developer/Xcode/DerivedData/jitsi-meet-hbqumcnhzlykisdvlutciopijbco/Build/Intermediates.noindex/ArchiveIntermediates/JitsiMeet/InstallationBuildProductsLocation/Applications/jitsi-meet.app/Frameworks --scan-folder /Users/jenkinsbuild/Library/Developer/Xcode/DerivedData/jitsi-meet-hbqumcnhzlykisdvlutciopijbco/Build/Intermediates.noindex/ArchiveIntermediates/JitsiMeet/InstallationBuildProductsLocation/Applications/jitsi-meet.app/PlugIns --scan-folder /Users/jenkinsbuild/jenkins-dss/workspace/72_bip-meet_sprint6_upgradeBuild/build/ReleaseEnt-iphoneos/JitsiMeetSDK.framework --platform iphoneos --toolchain /Applications/Xcode12.0.app/Contents/Developer/Toolchains/XcodeDefault.xctoolchain --destination /Users/jenkinsbuild/Library/Developer/Xcode/DerivedData/jitsi-meet-hbqumcnhzlykisdvlutciopijbco/Build/Intermediates.noindex/ArchiveIntermediates/JitsiMeet/InstallationBuildProductsLocation/Applications/jitsi-meet.app/Frameworks --unsigned-destination /Users/jenkinsbuild/Library/Developer/Xcode/DerivedData/jitsi-meet-hbqumcnhzlykisdvlutciopijbco/Build/Intermediates.noindex/ArchiveIntermediates/JitsiMeet/BuildProductsPath/SwiftSupport --emit-dependency-info /Users/jenkinsbuild/Library/Developer/Xcode/DerivedData/jitsi-meet-hbqumcnhzlykisdvlutciopijbco/Build/Intermediates.noindex/ArchiveIntermediates/JitsiMeet/IntermediateBuildFilesPath/app.build/ReleaseEnt-iphoneos/JitsiMeet.build/SwiftStdLibToolInputDependencies.dep
12:25:41  Copying /Applications/Xcode12.0.app/Contents/Developer/Toolchains/XcodeDefault.xctoolchain/usr/lib/swift-5.0/iphoneos/libswiftsimd.dylib to /Users/jenkinsbuild/Library/Developer/Xcode/DerivedData/jitsi-meet-hbqumcnhzlykisdvlutciopijbco/Build/Intermediates.noindex/ArchiveIntermediates/JitsiMeet/InstallationBuildProductsLocation/Applications/jitsi-meet.app/Frameworks/libswiftsimd.dylib
12:25:41  Copying /Applications/Xcode12.0.app/Contents/Developer/Toolchains/XcodeDefault.xctoolchain/usr/lib/swift-5.0/iphoneos/libswiftAccelerate.dylib to /Users/jenkinsbuild/Library/Developer/Xcode/DerivedData/jitsi-meet-hbqumcnhzlykisdvlutciopijbco/Build/Intermediates.noindex/ArchiveIntermediates/JitsiMeet/InstallationBuildProductsLocation/Applications/jitsi-meet.app/Frameworks/libswiftAccelerate.dylib
12:25:41  Copying /Applications/Xcode12.0.app/Contents/Developer/Toolchains/XcodeDefault.xctoolchain/usr/lib/swift-5.0/iphoneos/libswiftDarwin.dylib to /Users/jenkinsbuild/Library/Developer/Xcode/DerivedData/jitsi-meet-hbqumcnhzlykisdvlutciopijbco/Build/Intermediates.noindex/ArchiveIntermediates/JitsiMeet/InstallationBuildProductsLocation/Applications/jitsi-meet.app/Frameworks/libswiftDarwin.dylib
12:25:41  Copying /Applications/Xcode12.0.app/Contents/Developer/Toolchains/XcodeDefault.xctoolchain/usr/lib/swift-5.0/iphoneos/libswiftCoreGraphics.dylib to /Users/jenkinsbuild/Library/Developer/Xcode/DerivedData/jitsi-meet-hbqumcnhzlykisdvlutciopijbco/Build/Intermediates.noindex/ArchiveIntermediates/JitsiMeet/InstallationBuildProductsLocation/Applications/jitsi-meet.app/Frameworks/libswiftCoreGraphics.dylib
12:25:41  Copying /Applications/Xcode12.0.app/Contents/Developer/Toolchains/XcodeDefault.xctoolchain/usr/lib/swift-5.0/iphoneos/libswiftos.dylib to /Users/jenkinsbuild/Library/Developer/Xcode/DerivedData/jitsi-meet-hbqumcnhzlykisdvlutciopijbco/Build/Intermediates.noindex/ArchiveIntermediates/JitsiMeet/InstallationBuildProductsLocation/Applications/jitsi-meet.app/Frameworks/libswiftos.dylib
12:25:41  Copying /Applications/Xcode12.0.app/Contents/Developer/Toolchains/XcodeDefault.xctoolchain/usr/lib/swift-5.0/iphoneos/libswiftCoreFoundation.dylib to /Users/jenkinsbuild/Library/Developer/Xcode/DerivedData/jitsi-meet-hbqumcnhzlykisdvlutciopijbco/Build/Intermediates.noindex/ArchiveIntermediates/JitsiMeet/InstallationBuildProductsLocation/Applications/jitsi-meet.app/Frameworks/libswiftCoreFoundation.dylib
12:25:41  Copying /Applications/Xcode12.0.app/Contents/Developer/Toolchains/XcodeDefault.xctoolchain/usr/lib/swift-5.0/iphoneos/libswiftMetal.dylib to /Users/jenkinsbuild/Library/Developer/Xcode/DerivedData/jitsi-meet-hbqumcnhzlykisdvlutciopijbco/Build/Intermediates.noindex/ArchiveIntermediates/JitsiMeet/InstallationBuildProductsLocation/Applications/jitsi-meet.app/Frameworks/libswiftMetal.dylib
12:25:41  Copying /Applications/Xcode12.0.app/Contents/Developer/Toolchains/XcodeDefault.xctoolchain/usr/lib/swift-5.0/iphoneos/libswiftUIKit.dylib to /Users/jenkinsbuild/Library/Developer/Xcode/DerivedData/jitsi-meet-hbqumcnhzlykisdvlutciopijbco/Build/Intermediates.noindex/ArchiveIntermediates/JitsiMeet/InstallationBuildProductsLocation/Applications/jitsi-meet.app/Frameworks/libswiftUIKit.dylib
12:25:41  Copying /Applications/Xcode12.0.app/Contents/Developer/Toolchains/XcodeDefault.xctoolchain/usr/lib/swift-5.0/iphoneos/libswiftDispatch.dylib to /Users/jenkinsbuild/Library/Developer/Xcode/DerivedData/jitsi-meet-hbqumcnhzlykisdvlutciopijbco/Build/Intermediates.noindex/ArchiveIntermediates/JitsiMeet/InstallationBuildProductsLocation/Applications/jitsi-meet.app/Frameworks/libswiftDispatch.dylib
12:25:41  Copying /Applications/Xcode12.0.app/Contents/Developer/Toolchains/XcodeDefault.xctoolchain/usr/lib/swift-5.0/iphoneos/libswiftCore.dylib to /Users/jenkinsbuild/Library/Developer/Xcode/DerivedData/jitsi-meet-hbqumcnhzlykisdvlutciopijbco/Build/Intermediates.noindex/ArchiveIntermediates/JitsiMeet/InstallationBuildProductsLocation/Applications/jitsi-meet.app/Frameworks/libswiftCore.dylib
12:25:41  Copying /Applications/Xcode12.0.app/Contents/Developer/Toolchains/XcodeDefault.xctoolchain/usr/lib/swift-5.0/iphoneos/libswiftObjectiveC.dylib to /Users/jenkinsbuild/Library/Developer/Xcode/DerivedData/jitsi-meet-hbqumcnhzlykisdvlutciopijbco/Build/Intermediates.noindex/ArchiveIntermediates/JitsiMeet/InstallationBuildProductsLocation/Applications/jitsi-meet.app/Frameworks/libswiftObjectiveC.dylib
12:25:41  Copying /Applications/Xcode12.0.app/Contents/Developer/Toolchains/XcodeDefault.xctoolchain/usr/lib/swift-5.0/iphoneos/libswiftQuartzCore.dylib to /Users/jenkinsbuild/Library/Developer/Xcode/DerivedData/jitsi-meet-hbqumcnhzlykisdvlutciopijbco/Build/Intermediates.noindex/ArchiveIntermediates/JitsiMeet/InstallationBuildProductsLocation/Applications/jitsi-meet.app/Frameworks/libswiftQuartzCore.dylib
12:25:41  Copying /Applications/Xcode12.0.app/Contents/Developer/Toolchains/XcodeDefault.xctoolchain/usr/lib/swift-5.0/iphoneos/libswiftFoundation.dylib to /Users/jenkinsbuild/Library/Developer/Xcode/DerivedData/jitsi-meet-hbqumcnhzlykisdvlutciopijbco/Build/Intermediates.noindex/ArchiveIntermediates/JitsiMeet/InstallationBuildProductsLocation/Applications/jitsi-meet.app/Frameworks/libswiftFoundation.dylib
12:25:41  Copying /Applications/Xcode12.0.app/Contents/Developer/Toolchains/XcodeDefault.xctoolchain/usr/lib/swift-5.0/iphoneos/libswiftCoreAudio.dylib to /Users/jenkinsbuild/Library/Developer/Xcode/DerivedData/jitsi-meet-hbqumcnhzlykisdvlutciopijbco/Build/Intermediates.noindex/ArchiveIntermediates/JitsiMeet/InstallationBuildProductsLocation/Applications/jitsi-meet.app/Frameworks/libswiftCoreAudio.dylib
12:25:41  Copying /Applications/Xcode12.0.app/Contents/Developer/Toolchains/XcodeDefault.xctoolchain/usr/lib/swift-5.0/iphoneos/libswiftCallKit.dylib to /Users/jenkinsbuild/Library/Developer/Xcode/DerivedData/jitsi-meet-hbqumcnhzlykisdvlutciopijbco/Build/Intermediates.noindex/ArchiveIntermediates/JitsiMeet/InstallationBuildProductsLocation/Applications/jitsi-meet.app/Frameworks/libswiftCallKit.dylib
12:25:41  Copying /Applications/Xcode12.0.app/Contents/Developer/Toolchains/XcodeDefault.xctoolchain/usr/lib/swift-5.0/iphoneos/libswiftAVFoundation.dylib to /Users/jenkinsbuild/Library/Developer/Xcode/DerivedData/jitsi-meet-hbqumcnhzlykisdvlutciopijbco/Build/Intermediates.noindex/ArchiveIntermediates/JitsiMeet/InstallationBuildProductsLocation/Applications/jitsi-meet.app/Frameworks/libswiftAVFoundation.dylib
12:25:41  Copying /Applications/Xcode12.0.app/Contents/Developer/Toolchains/XcodeDefault.xctoolchain/usr/lib/swift-5.0/iphoneos/libswiftCoreImage.dylib to /Users/jenkinsbuild/Library/Developer/Xcode/DerivedData/jitsi-meet-hbqumcnhzlykisdvlutciopijbco/Build/Intermediates.noindex/ArchiveIntermediates/JitsiMeet/InstallationBuildProductsLocation/Applications/jitsi-meet.app/Frameworks/libswiftCoreImage.dylib
12:25:41  Copying /Applications/Xcode12.0.app/Contents/Developer/Toolchains/XcodeDefault.xctoolchain/usr/lib/swift-5.0/iphoneos/libswiftCoreMedia.dylib to /Users/jenkinsbuild/Library/Developer/Xcode/DerivedData/jitsi-meet-hbqumcnhzlykisdvlutciopijbco/Build/Intermediates.noindex/ArchiveIntermediates/JitsiMeet/InstallationBuildProductsLocation/Applications/jitsi-meet.app/Frameworks/libswiftCoreMedia.dylib
12:25:41  Copying /Applications/Xcode12.0.app/Contents/Developer/Toolchains/XcodeDefault.xctoolchain/usr/lib/swift-5.0/iphoneos/libswiftCoreLocation.dylib to /Users/jenkinsbuild/Library/Developer/Xcode/DerivedData/jitsi-meet-hbqumcnhzlykisdvlutciopijbco/Build/Intermediates.noindex/ArchiveIntermediates/JitsiMeet/InstallationBuildProductsLocation/Applications/jitsi-meet.app/Frameworks/libswiftCoreLocation.dylib
12:25:41  Copying /Applications/Xcode12.0.app/Contents/Developer/Toolchains/XcodeDefault.xctoolchain/usr/lib/swift-5.0/iphoneos/libswiftsimd.dylib to /Users/jenkinsbuild/Library/Developer/Xcode/DerivedData/jitsi-meet-hbqumcnhzlykisdvlutciopijbco/Build/Intermediates.noindex/ArchiveIntermediates/JitsiMeet/BuildProductsPath/SwiftSupport/iphoneos/libswiftsimd.dylib
12:25:41  Copying /Applications/Xcode12.0.app/Contents/Developer/Toolchains/XcodeDefault.xctoolchain/usr/lib/swift-5.0/iphoneos/libswiftAccelerate.dylib to /Users/jenkinsbuild/Library/Developer/Xcode/DerivedData/jitsi-meet-hbqumcnhzlykisdvlutciopijbco/Build/Intermediates.noindex/ArchiveIntermediates/JitsiMeet/BuildProductsPath/SwiftSupport/iphoneos/libswiftAccelerate.dylib
12:25:41  Copying /Applications/Xcode12.0.app/Contents/Developer/Toolchains/XcodeDefault.xctoolchain/usr/lib/swift-5.0/iphoneos/libswiftDarwin.dylib to /Users/jenkinsbuild/Library/Developer/Xcode/DerivedData/jitsi-meet-hbqumcnhzlykisdvlutciopijbco/Build/Intermediates.noindex/ArchiveIntermediates/JitsiMeet/BuildProductsPath/SwiftSupport/iphoneos/libswiftDarwin.dylib
12:25:41  Copying /Applications/Xcode12.0.app/Contents/Developer/Toolchains/XcodeDefault.xctoolchain/usr/lib/swift-5.0/iphoneos/libswiftCoreGraphics.dylib to /Users/jenkinsbuild/Library/Developer/Xcode/DerivedData/jitsi-meet-hbqumcnhzlykisdvlutciopijbco/Build/Intermediates.noindex/ArchiveIntermediates/JitsiMeet/BuildProductsPath/SwiftSupport/iphoneos/libswiftCoreGraphics.dylib
12:25:41  Copying /Applications/Xcode12.0.app/Contents/Developer/Toolchains/XcodeDefault.xctoolchain/usr/lib/swift-5.0/iphoneos/libswiftos.dylib to /Users/jenkinsbuild/Library/Developer/Xcode/DerivedData/jitsi-meet-hbqumcnhzlykisdvlutciopijbco/Build/Intermediates.noindex/ArchiveIntermediates/JitsiMeet/BuildProductsPath/SwiftSupport/iphoneos/libswiftos.dylib
12:25:41  Copying /Applications/Xcode12.0.app/Contents/Developer/Toolchains/XcodeDefault.xctoolchain/usr/lib/swift-5.0/iphoneos/libswiftCoreFoundation.dylib to /Users/jenkinsbuild/Library/Developer/Xcode/DerivedData/jitsi-meet-hbqumcnhzlykisdvlutciopijbco/Build/Intermediates.noindex/ArchiveIntermediates/JitsiMeet/BuildProductsPath/SwiftSupport/iphoneos/libswiftCoreFoundation.dylib
12:25:41  Copying /Applications/Xcode12.0.app/Contents/Developer/Toolchains/XcodeDefault.xctoolchain/usr/lib/swift-5.0/iphoneos/libswiftMetal.dylib to /Users/jenkinsbuild/Library/Developer/Xcode/DerivedData/jitsi-meet-hbqumcnhzlykisdvlutciopijbco/Build/Intermediates.noindex/ArchiveIntermediates/JitsiMeet/BuildProductsPath/SwiftSupport/iphoneos/libswiftMetal.dylib
12:25:41  Copying /Applications/Xcode12.0.app/Contents/Developer/Toolchains/XcodeDefault.xctoolchain/usr/lib/swift-5.0/iphoneos/libswiftUIKit.dylib to /Users/jenkinsbuild/Library/Developer/Xcode/DerivedData/jitsi-meet-hbqumcnhzlykisdvlutciopijbco/Build/Intermediates.noindex/ArchiveIntermediates/JitsiMeet/BuildProductsPath/SwiftSupport/iphoneos/libswiftUIKit.dylib
12:25:41  Copying /Applications/Xcode12.0.app/Contents/Developer/Toolchains/XcodeDefault.xctoolchain/usr/lib/swift-5.0/iphoneos/libswiftDispatch.dylib to /Users/jenkinsbuild/Library/Developer/Xcode/DerivedData/jitsi-meet-hbqumcnhzlykisdvlutciopijbco/Build/Intermediates.noindex/ArchiveIntermediates/JitsiMeet/BuildProductsPath/SwiftSupport/iphoneos/libswiftDispatch.dylib
12:25:41  Copying /Applications/Xcode12.0.app/Contents/Developer/Toolchains/XcodeDefault.xctoolchain/usr/lib/swift-5.0/iphoneos/libswiftCore.dylib to /Users/jenkinsbuild/Library/Developer/Xcode/DerivedData/jitsi-meet-hbqumcnhzlykisdvlutciopijbco/Build/Intermediates.noindex/ArchiveIntermediates/JitsiMeet/BuildProductsPath/SwiftSupport/iphoneos/libswiftCore.dylib
12:25:41  Copying /Applications/Xcode12.0.app/Contents/Developer/Toolchains/XcodeDefault.xctoolchain/usr/lib/swift-5.0/iphoneos/libswiftObjectiveC.dylib to /Users/jenkinsbuild/Library/Developer/Xcode/DerivedData/jitsi-meet-hbqumcnhzlykisdvlutciopijbco/Build/Intermediates.noindex/ArchiveIntermediates/JitsiMeet/BuildProductsPath/SwiftSupport/iphoneos/libswiftObjectiveC.dylib
12:25:41  Copying /Applications/Xcode12.0.app/Contents/Developer/Toolchains/XcodeDefault.xctoolchain/usr/lib/swift-5.0/iphoneos/libswiftQuartzCore.dylib to /Users/jenkinsbuild/Library/Developer/Xcode/DerivedData/jitsi-meet-hbqumcnhzlykisdvlutciopijbco/Build/Intermediates.noindex/ArchiveIntermediates/JitsiMeet/BuildProductsPath/SwiftSupport/iphoneos/libswiftQuartzCore.dylib
12:25:41  Copying /Applications/Xcode12.0.app/Contents/Developer/Toolchains/XcodeDefault.xctoolchain/usr/lib/swift-5.0/iphoneos/libswiftFoundation.dylib to /Users/jenkinsbuild/Library/Developer/Xcode/DerivedData/jitsi-meet-hbqumcnhzlykisdvlutciopijbco/Build/Intermediates.noindex/ArchiveIntermediates/JitsiMeet/BuildProductsPath/SwiftSupport/iphoneos/libswiftFoundation.dylib
12:25:41  Copying /Applications/Xcode12.0.app/Contents/Developer/Toolchains/XcodeDefault.xctoolchain/usr/lib/swift-5.0/iphoneos/libswiftCoreAudio.dylib to /Users/jenkinsbuild/Library/Developer/Xcode/DerivedData/jitsi-meet-hbqumcnhzlykisdvlutciopijbco/Build/Intermediates.noindex/ArchiveIntermediates/JitsiMeet/BuildProductsPath/SwiftSupport/iphoneos/libswiftCoreAudio.dylib
12:25:41  Copying /Applications/Xcode12.0.app/Contents/Developer/Toolchains/XcodeDefault.xctoolchain/usr/lib/swift-5.0/iphoneos/libswiftCallKit.dylib to /Users/jenkinsbuild/Library/Developer/Xcode/DerivedData/jitsi-meet-hbqumcnhzlykisdvlutciopijbco/Build/Intermediates.noindex/ArchiveIntermediates/JitsiMeet/BuildProductsPath/SwiftSupport/iphoneos/libswiftCallKit.dylib
12:25:41  Copying /Applications/Xcode12.0.app/Contents/Developer/Toolchains/XcodeDefault.xctoolchain/usr/lib/swift-5.0/iphoneos/libswiftAVFoundation.dylib to /Users/jenkinsbuild/Library/Developer/Xcode/DerivedData/jitsi-meet-hbqumcnhzlykisdvlutciopijbco/Build/Intermediates.noindex/ArchiveIntermediates/JitsiMeet/BuildProductsPath/SwiftSupport/iphoneos/libswiftAVFoundation.dylib
12:25:41  Copying /Applications/Xcode12.0.app/Contents/Developer/Toolchains/XcodeDefault.xctoolchain/usr/lib/swift-5.0/iphoneos/libswiftCoreImage.dylib to /Users/jenkinsbuild/Library/Developer/Xcode/DerivedData/jitsi-meet-hbqumcnhzlykisdvlutciopijbco/Build/Intermediates.noindex/ArchiveIntermediates/JitsiMeet/BuildProductsPath/SwiftSupport/iphoneos/libswiftCoreImage.dylib
12:25:41  Copying /Applications/Xcode12.0.app/Contents/Developer/Toolchains/XcodeDefault.xctoolchain/usr/lib/swift-5.0/iphoneos/libswiftCoreMedia.dylib to /Users/jenkinsbuild/Library/Developer/Xcode/DerivedData/jitsi-meet-hbqumcnhzlykisdvlutciopijbco/Build/Intermediates.noindex/ArchiveIntermediates/JitsiMeet/BuildProductsPath/SwiftSupport/iphoneos/libswiftCoreMedia.dylib
12:25:41  Copying /Applications/Xcode12.0.app/Contents/Developer/Toolchains/XcodeDefault.xctoolchain/usr/lib/swift-5.0/iphoneos/libswiftCoreLocation.dylib to /Users/jenkinsbuild/Library/Developer/Xcode/DerivedData/jitsi-meet-hbqumcnhzlykisdvlutciopijbco/Build/Intermediates.noindex/ArchiveIntermediates/JitsiMeet/BuildProductsPath/SwiftSupport/iphoneos/libswiftCoreLocation.dylib
12:25:41  Probing signature of /Users/jenkinsbuild/Library/Developer/Xcode/DerivedData/jitsi-meet-hbqumcnhzlykisdvlutciopijbco/Build/Intermediates.noindex/ArchiveIntermediates/JitsiMeet/InstallationBuildProductsLocation/Applications/jitsi-meet.app/Frameworks/libswiftsimd.dylib
12:25:41  /usr/bin/codesign -r- --display /Users/jenkinsbuild/Library/Developer/Xcode/DerivedData/jitsi-meet-hbqumcnhzlykisdvlutciopijbco/Build/Intermediates.noindex/ArchiveIntermediates/JitsiMeet/InstallationBuildProductsLocation/Applications/jitsi-meet.app/Frameworks/libswiftsimd.dylib
12:25:41  Codesigning /Users/jenkinsbuild/Library/Developer/Xcode/DerivedData/jitsi-meet-hbqumcnhzlykisdvlutciopijbco/Build/Intermediates.noindex/ArchiveIntermediates/JitsiMeet/InstallationBuildProductsLocation/Applications/jitsi-meet.app/Frameworks/libswiftsimd.dylib
12:25:41  /usr/bin/codesign --force --sign 571934C617E6AA93AABFC534D5B2EB0A68629D95 --verbose /Users/jenkinsbuild/Library/Developer/Xcode/DerivedData/jitsi-meet-hbqumcnhzlykisdvlutciopijbco/Build/Intermediates.noindex/ArchiveIntermediates/JitsiMeet/InstallationBuildProductsLocation/Applications/jitsi-meet.app/Frameworks/libswiftsimd.dylib
12:25:41  Probing signature of /Users/jenkinsbuild/Library/Developer/Xcode/DerivedData/jitsi-meet-hbqumcnhzlykisdvlutciopijbco/Build/Intermediates.noindex/ArchiveIntermediates/JitsiMeet/InstallationBuildProductsLocation/Applications/jitsi-meet.app/Frameworks/libswiftsimd.dylib
12:25:41  /usr/bin/codesign -r- --display /Users/jenkinsbuild/Library/Developer/Xcode/DerivedData/jitsi-meet-hbqumcnhzlykisdvlutciopijbco/Build/Intermediates.noindex/ArchiveIntermediates/JitsiMeet/InstallationBuildProductsLocation/Applications/jitsi-meet.app/Frameworks/libswiftsimd.dylib
12:25:41  Probing signature of /Users/jenkinsbuild/Library/Developer/Xcode/DerivedData/jitsi-meet-hbqumcnhzlykisdvlutciopijbco/Build/Intermediates.noindex/ArchiveIntermediates/JitsiMeet/InstallationBuildProductsLocation/Applications/jitsi-meet.app/Frameworks/libswiftAccelerate.dylib
12:25:41  Probing signature of /Users/jenkinsbuild/Library/Developer/Xcode/DerivedData/jitsi-meet-hbqumcnhzlykisdvlutciopijbco/Build/Intermediates.noindex/ArchiveIntermediates/JitsiMeet/InstallationBuildProductsLocation/Applications/jitsi-meet.app/Frameworks/libswiftDarwin.dylib
12:25:41  Probing signature of /Users/jenkinsbuild/Library/Developer/Xcode/DerivedData/jitsi-meet-hbqumcnhzlykisdvlutciopijbco/Build/Intermediates.noindex/ArchiveIntermediates/JitsiMeet/InstallationBuildProductsLocation/Applications/jitsi-meet.app/Frameworks/libswiftCoreGraphics.dylib
12:25:41  Probing signature of /Users/jenkinsbuild/Library/Developer/Xcode/DerivedData/jitsi-meet-hbqumcnhzlykisdvlutciopijbco/Build/Intermediates.noindex/ArchiveIntermediates/JitsiMeet/InstallationBuildProductsLocation/Applications/jitsi-meet.app/Frameworks/libswiftos.dylib
12:25:41  Probing signature of /Users/jenkinsbuild/Library/Developer/Xcode/DerivedData/jitsi-meet-hbqumcnhzlykisdvlutciopijbco/Build/Intermediates.noindex/ArchiveIntermediates/JitsiMeet/InstallationBuildProductsLocation/Applications/jitsi-meet.app/Frameworks/libswiftCoreFoundation.dylib
12:25:41  Probing signature of /Users/jenkinsbuild/Library/Developer/Xcode/DerivedData/jitsi-meet-hbqumcnhzlykisdvlutciopijbco/Build/Intermediates.noindex/ArchiveIntermediates/JitsiMeet/InstallationBuildProductsLocation/Applications/jitsi-meet.app/Frameworks/libswiftMetal.dylib
12:25:41  Probing signature of /Users/jenkinsbuild/Library/Developer/Xcode/DerivedData/jitsi-meet-hbqumcnhzlykisdvlutciopijbco/Build/Intermediates.noindex/ArchiveIntermediates/JitsiMeet/InstallationBuildProductsLocation/Applications/jitsi-meet.app/Frameworks/libswiftUIKit.dylib
12:25:41  Probing signature of /Users/jenkinsbuild/Library/Developer/Xcode/DerivedData/jitsi-meet-hbqumcnhzlykisdvlutciopijbco/Build/Intermediates.noindex/ArchiveIntermediates/JitsiMeet/InstallationBuildProductsLocation/Applications/jitsi-meet.app/Frameworks/libswiftDispatch.dylib
12:25:41  Probing signature of /Users/jenkinsbuild/Library/Developer/Xcode/DerivedData/jitsi-meet-hbqumcnhzlykisdvlutciopijbco/Build/Intermediates.noindex/ArchiveIntermediates/JitsiMeet/InstallationBuildProductsLocation/Applications/jitsi-meet.app/Frameworks/libswiftCore.dylib
12:25:41  Probing signature of /Users/jenkinsbuild/Library/Developer/Xcode/DerivedData/jitsi-meet-hbqumcnhzlykisdvlutciopijbco/Build/Intermediates.noindex/ArchiveIntermediates/JitsiMeet/InstallationBuildProductsLocation/Applications/jitsi-meet.app/Frameworks/libswiftObjectiveC.dylib
12:25:41  Probing signature of /Users/jenkinsbuild/Library/Developer/Xcode/DerivedData/jitsi-meet-hbqumcnhzlykisdvlutciopijbco/Build/Intermediates.noindex/ArchiveIntermediates/JitsiMeet/InstallationBuildProductsLocation/Applications/jitsi-meet.app/Frameworks/libswiftQuartzCore.dylib
12:25:41  Probing signature of /Users/jenkinsbuild/Library/Developer/Xcode/DerivedData/jitsi-meet-hbqumcnhzlykisdvlutciopijbco/Build/Intermediates.noindex/ArchiveIntermediates/JitsiMeet/InstallationBuildProductsLocation/Applications/jitsi-meet.app/Frameworks/libswiftFoundation.dylib
12:25:41  /usr/bin/codesign -r- --display /Users/jenkinsbuild/Library/Developer/Xcode/DerivedData/jitsi-meet-hbqumcnhzlykisdvlutciopijbco/Build/Intermediates.noindex/ArchiveIntermediates/JitsiMeet/InstallationBuildProductsLocation/Applications/jitsi-meet.app/Frameworks/libswiftAccelerate.dylib
12:25:41  /usr/bin/codesign -r- --display /Users/jenkinsbuild/Library/Developer/Xcode/DerivedData/jitsi-meet-hbqumcnhzlykisdvlutciopijbco/Build/Intermediates.noindex/ArchiveIntermediates/JitsiMeet/InstallationBuildProductsLocation/Applications/jitsi-meet.app/Frameworks/libswiftDarwin.dylib
12:25:41  /usr/bin/codesign -r- --display /Users/jenkinsbuild/Library/Developer/Xcode/DerivedData/jitsi-meet-hbqumcnhzlykisdvlutciopijbco/Build/Intermediates.noindex/ArchiveIntermediates/JitsiMeet/InstallationBuildProductsLocation/Applications/jitsi-meet.app/Frameworks/libswiftCoreGraphics.dylib
12:25:41  /usr/bin/codesign -r- --display /Users/jenkinsbuild/Library/Developer/Xcode/DerivedData/jitsi-meet-hbqumcnhzlykisdvlutciopijbco/Build/Intermediates.noindex/ArchiveIntermediates/JitsiMeet/InstallationBuildProductsLocation/Applications/jitsi-meet.app/Frameworks/libswiftos.dylib
12:25:41  /usr/bin/codesign -r- --display /Users/jenkinsbuild/Library/Developer/Xcode/DerivedData/jitsi-meet-hbqumcnhzlykisdvlutciopijbco/Build/Intermediates.noindex/ArchiveIntermediates/JitsiMeet/InstallationBuildProductsLocation/Applications/jitsi-meet.app/Frameworks/libswiftCoreFoundation.dylib
12:25:41  /usr/bin/codesign -r- --display /Users/jenkinsbuild/Library/Developer/Xcode/DerivedData/jitsi-meet-hbqumcnhzlykisdvlutciopijbco/Build/Intermediates.noindex/ArchiveIntermediates/JitsiMeet/InstallationBuildProductsLocation/Applications/jitsi-meet.app/Frameworks/libswiftMetal.dylib
12:25:41  /usr/bin/codesign -r- --display /Users/jenkinsbuild/Library/Developer/Xcode/DerivedData/jitsi-meet-hbqumcnhzlykisdvlutciopijbco/Build/Intermediates.noindex/ArchiveIntermediates/JitsiMeet/InstallationBuildProductsLocation/Applications/jitsi-meet.app/Frameworks/libswiftUIKit.dylib
12:25:41  /usr/bin/codesign -r- --display /Users/jenkinsbuild/Library/Developer/Xcode/DerivedData/jitsi-meet-hbqumcnhzlykisdvlutciopijbco/Build/Intermediates.noindex/ArchiveIntermediates/JitsiMeet/InstallationBuildProductsLocation/Applications/jitsi-meet.app/Frameworks/libswiftDispatch.dylib
12:25:41  /usr/bin/codesign -r- --display /Users/jenkinsbuild/Library/Developer/Xcode/DerivedData/jitsi-meet-hbqumcnhzlykisdvlutciopijbco/Build/Intermediates.noindex/ArchiveIntermediates/JitsiMeet/InstallationBuildProductsLocation/Applications/jitsi-meet.app/Frameworks/libswiftCore.dylib
12:25:41  /usr/bin/codesign -r- --display /Users/jenkinsbuild/Library/Developer/Xcode/DerivedData/jitsi-meet-hbqumcnhzlykisdvlutciopijbco/Build/Intermediates.noindex/ArchiveIntermediates/JitsiMeet/InstallationBuildProductsLocation/Applications/jitsi-meet.app/Frameworks/libswiftObjectiveC.dylib
12:25:41  /usr/bin/codesign -r- --display /Users/jenkinsbuild/Library/Developer/Xcode/DerivedData/jitsi-meet-hbqumcnhzlykisdvlutciopijbco/Build/Intermediates.noindex/ArchiveIntermediates/JitsiMeet/InstallationBuildProductsLocation/Applications/jitsi-meet.app/Frameworks/libswiftQuartzCore.dylib
12:25:41  /usr/bin/codesign -r- --display /Users/jenkinsbuild/Library/Developer/Xcode/DerivedData/jitsi-meet-hbqumcnhzlykisdvlutciopijbco/Build/Intermediates.noindex/ArchiveIntermediates/JitsiMeet/InstallationBuildProductsLocation/Applications/jitsi-meet.app/Frameworks/libswiftFoundation.dylib
12:25:41  Codesigning /Users/jenkinsbuild/Library/Developer/Xcode/DerivedData/jitsi-meet-hbqumcnhzlykisdvlutciopijbco/Build/Intermediates.noindex/ArchiveIntermediates/JitsiMeet/InstallationBuildProductsLocation/Applications/jitsi-meet.app/Frameworks/libswiftCoreFoundation.dylib
12:25:41  /usr/bin/codesign --force --sign 571934C617E6AA93AABFC534D5B2EB0A68629D95 --verbose /Users/jenkinsbuild/Library/Developer/Xcode/DerivedData/jitsi-meet-hbqumcnhzlykisdvlutciopijbco/Build/Intermediates.noindex/ArchiveIntermediates/JitsiMeet/InstallationBuildProductsLocation/Applications/jitsi-meet.app/Frameworks/libswiftCoreFoundation.dylib
12:25:41  Codesigning /Users/jenkinsbuild/Library/Developer/Xcode/DerivedData/jitsi-meet-hbqumcnhzlykisdvlutciopijbco/Build/Intermediates.noindex/ArchiveIntermediates/JitsiMeet/InstallationBuildProductsLocation/Applications/jitsi-meet.app/Frameworks/libswiftAccelerate.dylib
12:25:41  /usr/bin/codesign --force --sign 571934C617E6AA93AABFC534D5B2EB0A68629D95 --verbose /Users/jenkinsbuild/Library/Developer/Xcode/DerivedData/jitsi-meet-hbqumcnhzlykisdvlutciopijbco/Build/Intermediates.noindex/ArchiveIntermediates/JitsiMeet/InstallationBuildProductsLocation/Applications/jitsi-meet.app/Frameworks/libswiftAccelerate.dylib
12:25:41  Codesigning /Users/jenkinsbuild/Library/Developer/Xcode/DerivedData/jitsi-meet-hbqumcnhzlykisdvlutciopijbco/Build/Intermediates.noindex/ArchiveIntermediates/JitsiMeet/InstallationBuildProductsLocation/Applications/jitsi-meet.app/Frameworks/libswiftMetal.dylib
12:25:41  /usr/bin/codesign --force --sign 571934C617E6AA93AABFC534D5B2EB0A68629D95 --verbose /Users/jenkinsbuild/Library/Developer/Xcode/DerivedData/jitsi-meet-hbqumcnhzlykisdvlutciopijbco/Build/Intermediates.noindex/ArchiveIntermediates/JitsiMeet/InstallationBuildProductsLocation/Applications/jitsi-meet.app/Frameworks/libswiftMetal.dylib
12:25:41  Codesigning /Users/jenkinsbuild/Library/Developer/Xcode/DerivedData/jitsi-meet-hbqumcnhzlykisdvlutciopijbco/Build/Intermediates.noindex/ArchiveIntermediates/JitsiMeet/InstallationBuildProductsLocation/Applications/jitsi-meet.app/Frameworks/libswiftCoreGraphics.dylib
12:25:41  /usr/bin/codesign --force --sign 571934C617E6AA93AABFC534D5B2EB0A68629D95 --verbose /Users/jenkinsbuild/Library/Developer/Xcode/DerivedData/jitsi-meet-hbqumcnhzlykisdvlutciopijbco/Build/Intermediates.noindex/ArchiveIntermediates/JitsiMeet/InstallationBuildProductsLocation/Applications/jitsi-meet.app/Frameworks/libswiftCoreGraphics.dylib
12:25:41  Codesigning /Users/jenkinsbuild/Library/Developer/Xcode/DerivedData/jitsi-meet-hbqumcnhzlykisdvlutciopijbco/Build/Intermediates.noindex/ArchiveIntermediates/JitsiMeet/InstallationBuildProductsLocation/Applications/jitsi-meet.app/Frameworks/libswiftDarwin.dylib
12:25:41  /usr/bin/codesign --force --sign 571934C617E6AA93AABFC534D5B2EB0A68629D95 --verbose /Users/jenkinsbuild/Library/Developer/Xcode/DerivedData/jitsi-meet-hbqumcnhzlykisdvlutciopijbco/Build/Intermediates.noindex/ArchiveIntermediates/JitsiMeet/InstallationBuildProductsLocation/Applications/jitsi-meet.app/Frameworks/libswiftDarwin.dylib
12:25:41  Codesigning /Users/jenkinsbuild/Library/Developer/Xcode/DerivedData/jitsi-meet-hbqumcnhzlykisdvlutciopijbco/Build/Intermediates.noindex/ArchiveIntermediates/JitsiMeet/InstallationBuildProductsLocation/Applications/jitsi-meet.app/Frameworks/libswiftObjectiveC.dylib
12:25:41  /usr/bin/codesign --force --sign 571934C617E6AA93AABFC534D5B2EB0A68629D95 --verbose /Users/jenkinsbuild/Library/Developer/Xcode/DerivedData/jitsi-meet-hbqumcnhzlykisdvlutciopijbco/Build/Intermediates.noindex/ArchiveIntermediates/JitsiMeet/InstallationBuildProductsLocation/Applications/jitsi-meet.app/Frameworks/libswiftObjectiveC.dylib
12:25:41  Codesigning /Users/jenkinsbuild/Library/Developer/Xcode/DerivedData/jitsi-meet-hbqumcnhzlykisdvlutciopijbco/Build/Intermediates.noindex/ArchiveIntermediates/JitsiMeet/InstallationBuildProductsLocation/Applications/jitsi-meet.app/Frameworks/libswiftQuartzCore.dylib
12:25:41  /usr/bin/codesign --force --sign 571934C617E6AA93AABFC534D5B2EB0A68629D95 --verbose /Users/jenkinsbuild/Library/Developer/Xcode/DerivedData/jitsi-meet-hbqumcnhzlykisdvlutciopijbco/Build/Intermediates.noindex/ArchiveIntermediates/JitsiMeet/InstallationBuildProductsLocation/Applications/jitsi-meet.app/Frameworks/libswiftQuartzCore.dylib
12:25:41  Codesigning /Users/jenkinsbuild/Library/Developer/Xcode/DerivedData/jitsi-meet-hbqumcnhzlykisdvlutciopijbco/Build/Intermediates.noindex/ArchiveIntermediates/JitsiMeet/InstallationBuildProductsLocation/Applications/jitsi-meet.app/Frameworks/libswiftos.dylib
12:25:41  /usr/bin/codesign --force --sign 571934C617E6AA93AABFC534D5B2EB0A68629D95 --verbose /Users/jenkinsbuild/Library/Developer/Xcode/DerivedData/jitsi-meet-hbqumcnhzlykisdvlutciopijbco/Build/Intermediates.noindex/ArchiveIntermediates/JitsiMeet/InstallationBuildProductsLocation/Applications/jitsi-meet.app/Frameworks/libswiftos.dylib
12:25:41  Codesigning /Users/jenkinsbuild/Library/Developer/Xcode/DerivedData/jitsi-meet-hbqumcnhzlykisdvlutciopijbco/Build/Intermediates.noindex/ArchiveIntermediates/JitsiMeet/InstallationBuildProductsLocation/Applications/jitsi-meet.app/Frameworks/libswiftDispatch.dylib
12:25:41  /usr/bin/codesign --force --sign 571934C617E6AA93AABFC534D5B2EB0A68629D95 --verbose /Users/jenkinsbuild/Library/Developer/Xcode/DerivedData/jitsi-meet-hbqumcnhzlykisdvlutciopijbco/Build/Intermediates.noindex/ArchiveIntermediates/JitsiMeet/InstallationBuildProductsLocation/Applications/jitsi-meet.app/Frameworks/libswiftDispatch.dylib
12:25:41  Codesigning /Users/jenkinsbuild/Library/Developer/Xcode/DerivedData/jitsi-meet-hbqumcnhzlykisdvlutciopijbco/Build/Intermediates.noindex/ArchiveIntermediates/JitsiMeet/InstallationBuildProductsLocation/Applications/jitsi-meet.app/Frameworks/libswiftUIKit.dylib
12:25:41  /usr/bin/codesign --force --sign 571934C617E6AA93AABFC534D5B2EB0A68629D95 --verbose /Users/jenkinsbuild/Library/Developer/Xcode/DerivedData/jitsi-meet-hbqumcnhzlykisdvlutciopijbco/Build/Intermediates.noindex/ArchiveIntermediates/JitsiMeet/InstallationBuildProductsLocation/Applications/jitsi-meet.app/Frameworks/libswiftUIKit.dylib
12:25:41  Codesigning /Users/jenkinsbuild/Library/Developer/Xcode/DerivedData/jitsi-meet-hbqumcnhzlykisdvlutciopijbco/Build/Intermediates.noindex/ArchiveIntermediates/JitsiMeet/InstallationBuildProductsLocation/Applications/jitsi-meet.app/Frameworks/libswiftCore.dylib
12:25:41  /usr/bin/codesign --force --sign 571934C617E6AA93AABFC534D5B2EB0A68629D95 --verbose /Users/jenkinsbuild/Library/Developer/Xcode/DerivedData/jitsi-meet-hbqumcnhzlykisdvlutciopijbco/Build/Intermediates.noindex/ArchiveIntermediates/JitsiMeet/InstallationBuildProductsLocation/Applications/jitsi-meet.app/Frameworks/libswiftCore.dylib
12:25:41  Codesigning /Users/jenkinsbuild/Library/Developer/Xcode/DerivedData/jitsi-meet-hbqumcnhzlykisdvlutciopijbco/Build/Intermediates.noindex/ArchiveIntermediates/JitsiMeet/InstallationBuildProductsLocation/Applications/jitsi-meet.app/Frameworks/libswiftFoundation.dylib
12:25:41  /usr/bin/codesign --force --sign 571934C617E6AA93AABFC534D5B2EB0A68629D95 --verbose /Users/jenkinsbuild/Library/Developer/Xcode/DerivedData/jitsi-meet-hbqumcnhzlykisdvlutciopijbco/Build/Intermediates.noindex/ArchiveIntermediates/JitsiMeet/InstallationBuildProductsLocation/Applications/jitsi-meet.app/Frameworks/libswiftFoundation.dylib
12:25:41  Probing signature of /Users/jenkinsbuild/Library/Developer/Xcode/DerivedData/jitsi-meet-hbqumcnhzlykisdvlutciopijbco/Build/Intermediates.noindex/ArchiveIntermediates/JitsiMeet/InstallationBuildProductsLocation/Applications/jitsi-meet.app/Frameworks/libswiftCoreFoundation.dylib
12:25:41  /usr/bin/codesign -r- --display /Users/jenkinsbuild/Library/Developer/Xcode/DerivedData/jitsi-meet-hbqumcnhzlykisdvlutciopijbco/Build/Intermediates.noindex/ArchiveIntermediates/JitsiMeet/InstallationBuildProductsLocation/Applications/jitsi-meet.app/Frameworks/libswiftCoreFoundation.dylib
12:25:41  Probing signature of /Users/jenkinsbuild/Library/Developer/Xcode/DerivedData/jitsi-meet-hbqumcnhzlykisdvlutciopijbco/Build/Intermediates.noindex/ArchiveIntermediates/JitsiMeet/InstallationBuildProductsLocation/Applications/jitsi-meet.app/Frameworks/libswiftCoreAudio.dylib
12:25:41  /usr/bin/codesign -r- --display /Users/jenkinsbuild/Library/Developer/Xcode/DerivedData/jitsi-meet-hbqumcnhzlykisdvlutciopijbco/Build/Intermediates.noindex/ArchiveIntermediates/JitsiMeet/InstallationBuildProductsLocation/Applications/jitsi-meet.app/Frameworks/libswiftCoreAudio.dylib
12:25:41  Codesigning /Users/jenkinsbuild/Library/Developer/Xcode/DerivedData/jitsi-meet-hbqumcnhzlykisdvlutciopijbco/Build/Intermediates.noindex/ArchiveIntermediates/JitsiMeet/InstallationBuildProductsLocation/Applications/jitsi-meet.app/Frameworks/libswiftCoreAudio.dylib
12:25:41  /usr/bin/codesign --force --sign 571934C617E6AA93AABFC534D5B2EB0A68629D95 --verbose /Users/jenkinsbuild/Library/Developer/Xcode/DerivedData/jitsi-meet-hbqumcnhzlykisdvlutciopijbco/Build/Intermediates.noindex/ArchiveIntermediates/JitsiMeet/InstallationBuildProductsLocation/Applications/jitsi-meet.app/Frameworks/libswiftCoreAudio.dylib
12:25:41  Probing signature of /Users/jenkinsbuild/Library/Developer/Xcode/DerivedData/jitsi-meet-hbqumcnhzlykisdvlutciopijbco/Build/Intermediates.noindex/ArchiveIntermediates/JitsiMeet/InstallationBuildProductsLocation/Applications/jitsi-meet.app/Frameworks/libswiftAccelerate.dylib
12:25:41  /usr/bin/codesign -r- --display /Users/jenkinsbuild/Library/Developer/Xcode/DerivedData/jitsi-meet-hbqumcnhzlykisdvlutciopijbco/Build/Intermediates.noindex/ArchiveIntermediates/JitsiMeet/InstallationBuildProductsLocation/Applications/jitsi-meet.app/Frameworks/libswiftAccelerate.dylib
12:25:41  Probing signature of /Users/jenkinsbuild/Library/Developer/Xcode/DerivedData/jitsi-meet-hbqumcnhzlykisdvlutciopijbco/Build/Intermediates.noindex/ArchiveIntermediates/JitsiMeet/InstallationBuildProductsLocation/Applications/jitsi-meet.app/Frameworks/libswiftCallKit.dylib
12:25:41  /usr/bin/codesign -r- --display /Users/jenkinsbuild/Library/Developer/Xcode/DerivedData/jitsi-meet-hbqumcnhzlykisdvlutciopijbco/Build/Intermediates.noindex/ArchiveIntermediates/JitsiMeet/InstallationBuildProductsLocation/Applications/jitsi-meet.app/Frameworks/libswiftCallKit.dylib
12:25:41  Codesigning /Users/jenkinsbuild/Library/Developer/Xcode/DerivedData/jitsi-meet-hbqumcnhzlykisdvlutciopijbco/Build/Intermediates.noindex/ArchiveIntermediates/JitsiMeet/InstallationBuildProductsLocation/Applications/jitsi-meet.app/Frameworks/libswiftCallKit.dylib
12:25:41  /usr/bin/codesign --force --sign 571934C617E6AA93AABFC534D5B2EB0A68629D95 --verbose /Users/jenkinsbuild/Library/Developer/Xcode/DerivedData/jitsi-meet-hbqumcnhzlykisdvlutciopijbco/Build/Intermediates.noindex/ArchiveIntermediates/JitsiMeet/InstallationBuildProductsLocation/Applications/jitsi-meet.app/Frameworks/libswiftCallKit.dylib
12:25:41  Probing signature of /Users/jenkinsbuild/Library/Developer/Xcode/DerivedData/jitsi-meet-hbqumcnhzlykisdvlutciopijbco/Build/Intermediates.noindex/ArchiveIntermediates/JitsiMeet/InstallationBuildProductsLocation/Applications/jitsi-meet.app/Frameworks/libswiftDarwin.dylib
12:25:41  /usr/bin/codesign -r- --display /Users/jenkinsbuild/Library/Developer/Xcode/DerivedData/jitsi-meet-hbqumcnhzlykisdvlutciopijbco/Build/Intermediates.noindex/ArchiveIntermediates/JitsiMeet/InstallationBuildProductsLocation/Applications/jitsi-meet.app/Frameworks/libswiftDarwin.dylib
12:25:41  Probing signature of /Users/jenkinsbuild/Library/Developer/Xcode/DerivedData/jitsi-meet-hbqumcnhzlykisdvlutciopijbco/Build/Intermediates.noindex/ArchiveIntermediates/JitsiMeet/InstallationBuildProductsLocation/Applications/jitsi-meet.app/Frameworks/libswiftObjectiveC.dylib
12:25:41  /usr/bin/codesign -r- --display /Users/jenkinsbuild/Library/Developer/Xcode/DerivedData/jitsi-meet-hbqumcnhzlykisdvlutciopijbco/Build/Intermediates.noindex/ArchiveIntermediates/JitsiMeet/InstallationBuildProductsLocation/Applications/jitsi-meet.app/Frameworks/libswiftObjectiveC.dylib
12:25:41  Probing signature of /Users/jenkinsbuild/Library/Developer/Xcode/DerivedData/jitsi-meet-hbqumcnhzlykisdvlutciopijbco/Build/Intermediates.noindex/ArchiveIntermediates/JitsiMeet/InstallationBuildProductsLocation/Applications/jitsi-meet.app/Frameworks/libswiftAVFoundation.dylib
12:25:41  /usr/bin/codesign -r- --display /Users/jenkinsbuild/Library/Developer/Xcode/DerivedData/jitsi-meet-hbqumcnhzlykisdvlutciopijbco/Build/Intermediates.noindex/ArchiveIntermediates/JitsiMeet/InstallationBuildProductsLocation/Applications/jitsi-meet.app/Frameworks/libswiftAVFoundation.dylib
12:25:41  Probing signature of /Users/jenkinsbuild/Library/Developer/Xcode/DerivedData/jitsi-meet-hbqumcnhzlykisdvlutciopijbco/Build/Intermediates.noindex/ArchiveIntermediates/JitsiMeet/InstallationBuildProductsLocation/Applications/jitsi-meet.app/Frameworks/libswiftMetal.dylib
12:25:41  /usr/bin/codesign -r- --display /Users/jenkinsbuild/Library/Developer/Xcode/DerivedData/jitsi-meet-hbqumcnhzlykisdvlutciopijbco/Build/Intermediates.noindex/ArchiveIntermediates/JitsiMeet/InstallationBuildProductsLocation/Applications/jitsi-meet.app/Frameworks/libswiftMetal.dylib
12:25:41  Probing signature of /Users/jenkinsbuild/Library/Developer/Xcode/DerivedData/jitsi-meet-hbqumcnhzlykisdvlutciopijbco/Build/Intermediates.noindex/ArchiveIntermediates/JitsiMeet/InstallationBuildProductsLocation/Applications/jitsi-meet.app/Frameworks/libswiftCoreImage.dylib
12:25:41  /usr/bin/codesign -r- --display /Users/jenkinsbuild/Library/Developer/Xcode/DerivedData/jitsi-meet-hbqumcnhzlykisdvlutciopijbco/Build/Intermediates.noindex/ArchiveIntermediates/JitsiMeet/InstallationBuildProductsLocation/Applications/jitsi-meet.app/Frameworks/libswiftCoreImage.dylib
12:25:41  Codesigning /Users/jenkinsbuild/Library/Developer/Xcode/DerivedData/jitsi-meet-hbqumcnhzlykisdvlutciopijbco/Build/Intermediates.noindex/ArchiveIntermediates/JitsiMeet/InstallationBuildProductsLocation/Applications/jitsi-meet.app/Frameworks/libswiftAVFoundation.dylib
12:25:41  /usr/bin/codesign --force --sign 571934C617E6AA93AABFC534D5B2EB0A68629D95 --verbose /Users/jenkinsbuild/Library/Developer/Xcode/DerivedData/jitsi-meet-hbqumcnhzlykisdvlutciopijbco/Build/Intermediates.noindex/ArchiveIntermediates/JitsiMeet/InstallationBuildProductsLocation/Applications/jitsi-meet.app/Frameworks/libswiftAVFoundation.dylib
12:25:41  Probing signature of /Users/jenkinsbuild/Library/Developer/Xcode/DerivedData/jitsi-meet-hbqumcnhzlykisdvlutciopijbco/Build/Intermediates.noindex/ArchiveIntermediates/JitsiMeet/InstallationBuildProductsLocation/Applications/jitsi-meet.app/Frameworks/libswiftCoreMedia.dylib
12:25:41  /usr/bin/codesign -r- --display /Users/jenkinsbuild/Library/Developer/Xcode/DerivedData/jitsi-meet-hbqumcnhzlykisdvlutciopijbco/Build/Intermediates.noindex/ArchiveIntermediates/JitsiMeet/InstallationBuildProductsLocation/Applications/jitsi-meet.app/Frameworks/libswiftCoreMedia.dylib
12:25:41  Codesigning /Users/jenkinsbuild/Library/Developer/Xcode/DerivedData/jitsi-meet-hbqumcnhzlykisdvlutciopijbco/Build/Intermediates.noindex/ArchiveIntermediates/JitsiMeet/InstallationBuildProductsLocation/Applications/jitsi-meet.app/Frameworks/libswiftCoreImage.dylib
12:25:41  /usr/bin/codesign --force --sign 571934C617E6AA93AABFC534D5B2EB0A68629D95 --verbose /Users/jenkinsbuild/Library/Developer/Xcode/DerivedData/jitsi-meet-hbqumcnhzlykisdvlutciopijbco/Build/Intermediates.noindex/ArchiveIntermediates/JitsiMeet/InstallationBuildProductsLocation/Applications/jitsi-meet.app/Frameworks/libswiftCoreImage.dylib
12:25:41  Codesigning /Users/jenkinsbuild/Library/Developer/Xcode/DerivedData/jitsi-meet-hbqumcnhzlykisdvlutciopijbco/Build/Intermediates.noindex/ArchiveIntermediates/JitsiMeet/InstallationBuildProductsLocation/Applications/jitsi-meet.app/Frameworks/libswiftCoreMedia.dylib
12:25:41  /usr/bin/codesign --force --sign 571934C617E6AA93AABFC534D5B2EB0A68629D95 --verbose /Users/jenkinsbuild/Library/Developer/Xcode/DerivedData/jitsi-meet-hbqumcnhzlykisdvlutciopijbco/Build/Intermediates.noindex/ArchiveIntermediates/JitsiMeet/InstallationBuildProductsLocation/Applications/jitsi-meet.app/Frameworks/libswiftCoreMedia.dylib
12:25:41  Probing signature of /Users/jenkinsbuild/Library/Developer/Xcode/DerivedData/jitsi-meet-hbqumcnhzlykisdvlutciopijbco/Build/Intermediates.noindex/ArchiveIntermediates/JitsiMeet/InstallationBuildProductsLocation/Applications/jitsi-meet.app/Frameworks/libswiftQuartzCore.dylib
12:25:41  /usr/bin/codesign -r- --display /Users/jenkinsbuild/Library/Developer/Xcode/DerivedData/jitsi-meet-hbqumcnhzlykisdvlutciopijbco/Build/Intermediates.noindex/ArchiveIntermediates/JitsiMeet/InstallationBuildProductsLocation/Applications/jitsi-meet.app/Frameworks/libswiftQuartzCore.dylib
12:25:41  Probing signature of /Users/jenkinsbuild/Library/Developer/Xcode/DerivedData/jitsi-meet-hbqumcnhzlykisdvlutciopijbco/Build/Intermediates.noindex/ArchiveIntermediates/JitsiMeet/InstallationBuildProductsLocation/Applications/jitsi-meet.app/Frameworks/libswiftCoreLocation.dylib
12:25:41  /usr/bin/codesign -r- --display /Users/jenkinsbuild/Library/Developer/Xcode/DerivedData/jitsi-meet-hbqumcnhzlykisdvlutciopijbco/Build/Intermediates.noindex/ArchiveIntermediates/JitsiMeet/InstallationBuildProductsLocation/Applications/jitsi-meet.app/Frameworks/libswiftCoreLocation.dylib
12:25:41  Codesigning /Users/jenkinsbuild/Library/Developer/Xcode/DerivedData/jitsi-meet-hbqumcnhzlykisdvlutciopijbco/Build/Intermediates.noindex/ArchiveIntermediates/JitsiMeet/InstallationBuildProductsLocation/Applications/jitsi-meet.app/Frameworks/libswiftCoreLocation.dylib
12:25:41  /usr/bin/codesign --force --sign 571934C617E6AA93AABFC534D5B2EB0A68629D95 --verbose /Users/jenkinsbuild/Library/Developer/Xcode/DerivedData/jitsi-meet-hbqumcnhzlykisdvlutciopijbco/Build/Intermediates.noindex/ArchiveIntermediates/JitsiMeet/InstallationBuildProductsLocation/Applications/jitsi-meet.app/Frameworks/libswiftCoreLocation.dylib
12:25:41  Probing signature of /Users/jenkinsbuild/Library/Developer/Xcode/DerivedData/jitsi-meet-hbqumcnhzlykisdvlutciopijbco/Build/Intermediates.noindex/ArchiveIntermediates/JitsiMeet/InstallationBuildProductsLocation/Applications/jitsi-meet.app/Frameworks/libswiftUIKit.dylib
12:25:41  /usr/bin/codesign -r- --display /Users/jenkinsbuild/Library/Developer/Xcode/DerivedData/jitsi-meet-hbqumcnhzlykisdvlutciopijbco/Build/Intermediates.noindex/ArchiveIntermediates/JitsiMeet/InstallationBuildProductsLocation/Applications/jitsi-meet.app/Frameworks/libswiftUIKit.dylib
12:25:41  Probing signature of /Users/jenkinsbuild/Library/Developer/Xcode/DerivedData/jitsi-meet-hbqumcnhzlykisdvlutciopijbco/Build/Intermediates.noindex/ArchiveIntermediates/JitsiMeet/InstallationBuildProductsLocation/Applications/jitsi-meet.app/Frameworks/libswiftos.dylib
12:25:41  Probing signature of /Users/jenkinsbuild/Library/Developer/Xcode/DerivedData/jitsi-meet-hbqumcnhzlykisdvlutciopijbco/Build/Intermediates.noindex/ArchiveIntermediates/JitsiMeet/InstallationBuildProductsLocation/Applications/jitsi-meet.app/Frameworks/libswiftCoreGraphics.dylib
12:25:41  /usr/bin/codesign -r- --display /Users/jenkinsbuild/Library/Developer/Xcode/DerivedData/jitsi-meet-hbqumcnhzlykisdvlutciopijbco/Build/Intermediates.noindex/ArchiveIntermediates/JitsiMeet/InstallationBuildProductsLocation/Applications/jitsi-meet.app/Frameworks/libswiftos.dylib
12:25:41  /usr/bin/codesign -r- --display /Users/jenkinsbuild/Library/Developer/Xcode/DerivedData/jitsi-meet-hbqumcnhzlykisdvlutciopijbco/Build/Intermediates.noindex/ArchiveIntermediates/JitsiMeet/InstallationBuildProductsLocation/Applications/jitsi-meet.app/Frameworks/libswiftCoreGraphics.dylib
12:25:41  Probing signature of /Users/jenkinsbuild/Library/Developer/Xcode/DerivedData/jitsi-meet-hbqumcnhzlykisdvlutciopijbco/Build/Intermediates.noindex/ArchiveIntermediates/JitsiMeet/InstallationBuildProductsLocation/Applications/jitsi-meet.app/Frameworks/libswiftCoreAudio.dylib
12:25:41  /usr/bin/codesign -r- --display /Users/jenkinsbuild/Library/Developer/Xcode/DerivedData/jitsi-meet-hbqumcnhzlykisdvlutciopijbco/Build/Intermediates.noindex/ArchiveIntermediates/JitsiMeet/InstallationBuildProductsLocation/Applications/jitsi-meet.app/Frameworks/libswiftCoreAudio.dylib
12:25:41  Probing signature of /Users/jenkinsbuild/Library/Developer/Xcode/DerivedData/jitsi-meet-hbqumcnhzlykisdvlutciopijbco/Build/Intermediates.noindex/ArchiveIntermediates/JitsiMeet/InstallationBuildProductsLocation/Applications/jitsi-meet.app/Frameworks/libswiftDispatch.dylib
12:25:41  /usr/bin/codesign -r- --display /Users/jenkinsbuild/Library/Developer/Xcode/DerivedData/jitsi-meet-hbqumcnhzlykisdvlutciopijbco/Build/Intermediates.noindex/ArchiveIntermediates/JitsiMeet/InstallationBuildProductsLocation/Applications/jitsi-meet.app/Frameworks/libswiftDispatch.dylib
12:25:42  Probing signature of /Users/jenkinsbuild/Library/Developer/Xcode/DerivedData/jitsi-meet-hbqumcnhzlykisdvlutciopijbco/Build/Intermediates.noindex/ArchiveIntermediates/JitsiMeet/InstallationBuildProductsLocation/Applications/jitsi-meet.app/Frameworks/libswiftCallKit.dylib
12:25:42  /usr/bin/codesign -r- --display /Users/jenkinsbuild/Library/Developer/Xcode/DerivedData/jitsi-meet-hbqumcnhzlykisdvlutciopijbco/Build/Intermediates.noindex/ArchiveIntermediates/JitsiMeet/InstallationBuildProductsLocation/Applications/jitsi-meet.app/Frameworks/libswiftCallKit.dylib
12:25:42  Probing signature of /Users/jenkinsbuild/Library/Developer/Xcode/DerivedData/jitsi-meet-hbqumcnhzlykisdvlutciopijbco/Build/Intermediates.noindex/ArchiveIntermediates/JitsiMeet/InstallationBuildProductsLocation/Applications/jitsi-meet.app/Frameworks/libswiftCoreImage.dylib
12:25:42  /usr/bin/codesign -r- --display /Users/jenkinsbuild/Library/Developer/Xcode/DerivedData/jitsi-meet-hbqumcnhzlykisdvlutciopijbco/Build/Intermediates.noindex/ArchiveIntermediates/JitsiMeet/InstallationBuildProductsLocation/Applications/jitsi-meet.app/Frameworks/libswiftCoreImage.dylib
12:25:42  Probing signature of /Users/jenkinsbuild/Library/Developer/Xcode/DerivedData/jitsi-meet-hbqumcnhzlykisdvlutciopijbco/Build/Intermediates.noindex/ArchiveIntermediates/JitsiMeet/InstallationBuildProductsLocation/Applications/jitsi-meet.app/Frameworks/libswiftAVFoundation.dylib
12:25:42  /usr/bin/codesign -r- --display /Users/jenkinsbuild/Library/Developer/Xcode/DerivedData/jitsi-meet-hbqumcnhzlykisdvlutciopijbco/Build/Intermediates.noindex/ArchiveIntermediates/JitsiMeet/InstallationBuildProductsLocation/Applications/jitsi-meet.app/Frameworks/libswiftAVFoundation.dylib
12:25:42  Probing signature of /Users/jenkinsbuild/Library/Developer/Xcode/DerivedData/jitsi-meet-hbqumcnhzlykisdvlutciopijbco/Build/Intermediates.noindex/ArchiveIntermediates/JitsiMeet/InstallationBuildProductsLocation/Applications/jitsi-meet.app/Frameworks/libswiftCoreMedia.dylib
12:25:42  /usr/bin/codesign -r- --display /Users/jenkinsbuild/Library/Developer/Xcode/DerivedData/jitsi-meet-hbqumcnhzlykisdvlutciopijbco/Build/Intermediates.noindex/ArchiveIntermediates/JitsiMeet/InstallationBuildProductsLocation/Applications/jitsi-meet.app/Frameworks/libswiftCoreMedia.dylib
12:25:42  Probing signature of /Users/jenkinsbuild/Library/Developer/Xcode/DerivedData/jitsi-meet-hbqumcnhzlykisdvlutciopijbco/Build/Intermediates.noindex/ArchiveIntermediates/JitsiMeet/InstallationBuildProductsLocation/Applications/jitsi-meet.app/Frameworks/libswiftCoreLocation.dylib
12:25:42  /usr/bin/codesign -r- --display /Users/jenkinsbuild/Library/Developer/Xcode/DerivedData/jitsi-meet-hbqumcnhzlykisdvlutciopijbco/Build/Intermediates.noindex/ArchiveIntermediates/JitsiMeet/InstallationBuildProductsLocation/Applications/jitsi-meet.app/Frameworks/libswiftCoreLocation.dylib
12:25:42  Probing signature of /Users/jenkinsbuild/Library/Developer/Xcode/DerivedData/jitsi-meet-hbqumcnhzlykisdvlutciopijbco/Build/Intermediates.noindex/ArchiveIntermediates/JitsiMeet/InstallationBuildProductsLocation/Applications/jitsi-meet.app/Frameworks/libswiftFoundation.dylib
12:25:42  /usr/bin/codesign -r- --display /Users/jenkinsbuild/Library/Developer/Xcode/DerivedData/jitsi-meet-hbqumcnhzlykisdvlutciopijbco/Build/Intermediates.noindex/ArchiveIntermediates/JitsiMeet/InstallationBuildProductsLocation/Applications/jitsi-meet.app/Frameworks/libswiftFoundation.dylib
12:25:42  Probing signature of /Users/jenkinsbuild/Library/Developer/Xcode/DerivedData/jitsi-meet-hbqumcnhzlykisdvlutciopijbco/Build/Intermediates.noindex/ArchiveIntermediates/JitsiMeet/InstallationBuildProductsLocation/Applications/jitsi-meet.app/Frameworks/libswiftCore.dylib
12:25:42  /usr/bin/codesign -r- --display /Users/jenkinsbuild/Library/Developer/Xcode/DerivedData/jitsi-meet-hbqumcnhzlykisdvlutciopijbco/Build/Intermediates.noindex/ArchiveIntermediates/JitsiMeet/InstallationBuildProductsLocation/Applications/jitsi-meet.app/Frameworks/libswiftCore.dylib
12:25:42  
12:25:42  Strip /Users/jenkinsbuild/Library/Developer/Xcode/DerivedData/jitsi-meet-hbqumcnhzlykisdvlutciopijbco/Build/Intermediates.noindex/ArchiveIntermediates/JitsiMeet/InstallationBuildProductsLocation/Applications/jitsi-meet.app/jitsi-meet (in target 'JitsiMeet' from project 'app')
12:25:42      cd /Users/jenkinsbuild/jenkins-dss/workspace/72_bip-meet_sprint6_upgradeBuild/ios/app
12:25:42      /Applications/Xcode12.0.app/Contents/Developer/Toolchains/XcodeDefault.xctoolchain/usr/bin/strip /Users/jenkinsbuild/Library/Developer/Xcode/DerivedData/jitsi-meet-hbqumcnhzlykisdvlutciopijbco/Build/Intermediates.noindex/ArchiveIntermediates/JitsiMeet/InstallationBuildProductsLocation/Applications/jitsi-meet.app/jitsi-meet
12:25:42  
12:25:42  SetOwnerAndGroup jenkinsbuild:1530679350 /Users/jenkinsbuild/Library/Developer/Xcode/DerivedData/jitsi-meet-hbqumcnhzlykisdvlutciopijbco/Build/Intermediates.noindex/ArchiveIntermediates/JitsiMeet/InstallationBuildProductsLocation/Applications/jitsi-meet.app (in target 'JitsiMeet' from project 'app')
12:25:42      cd /Users/jenkinsbuild/jenkins-dss/workspace/72_bip-meet_sprint6_upgradeBuild/ios/app
12:25:42      /usr/sbin/chown -RH jenkinsbuild:1530679350 /Users/jenkinsbuild/Library/Developer/Xcode/DerivedData/jitsi-meet-hbqumcnhzlykisdvlutciopijbco/Build/Intermediates.noindex/ArchiveIntermediates/JitsiMeet/InstallationBuildProductsLocation/Applications/jitsi-meet.app
12:25:42  
12:25:42  SetMode u+w,go-w,a+rX /Users/jenkinsbuild/Library/Developer/Xcode/DerivedData/jitsi-meet-hbqumcnhzlykisdvlutciopijbco/Build/Intermediates.noindex/ArchiveIntermediates/JitsiMeet/InstallationBuildProductsLocation/Applications/jitsi-meet.app (in target 'JitsiMeet' from project 'app')
12:25:42      cd /Users/jenkinsbuild/jenkins-dss/workspace/72_bip-meet_sprint6_upgradeBuild/ios/app
12:25:42      /bin/chmod -RH u+w,go-w,a+rX /Users/jenkinsbuild/Library/Developer/Xcode/DerivedData/jitsi-meet-hbqumcnhzlykisdvlutciopijbco/Build/Intermediates.noindex/ArchiveIntermediates/JitsiMeet/InstallationBuildProductsLocation/Applications/jitsi-meet.app
12:25:42  
12:25:42  CodeSign /Users/jenkinsbuild/Library/Developer/Xcode/DerivedData/jitsi-meet-hbqumcnhzlykisdvlutciopijbco/Build/Intermediates.noindex/ArchiveIntermediates/JitsiMeet/InstallationBuildProductsLocation/Applications/jitsi-meet.app (in target 'JitsiMeet' from project 'app')
12:25:42      cd /Users/jenkinsbuild/jenkins-dss/workspace/72_bip-meet_sprint6_upgradeBuild/ios/app
12:25:42      export CODESIGN_ALLOCATE\=/Applications/Xcode12.0.app/Contents/Developer/Toolchains/XcodeDefault.xctoolchain/usr/bin/codesign_allocate
12:25:42      
12:25:42  Signing Identity:     "iPhone Distribution: Turkcell Iletisim Hizmetleri A. S."
12:25:42  Provisioning Profile: "bipmeet enterprise"
12:25:42                        (15f79446-fde9-4e8c-bef4-970afc6c3f65)
12:25:42  
12:25:42      /usr/bin/codesign --force --sign 571934C617E6AA93AABFC534D5B2EB0A68629D95 --entitlements /Users/jenkinsbuild/Library/Developer/Xcode/DerivedData/jitsi-meet-hbqumcnhzlykisdvlutciopijbco/Build/Intermediates.noindex/ArchiveIntermediates/JitsiMeet/IntermediateBuildFilesPath/app.build/ReleaseEnt-iphoneos/JitsiMeet.build/jitsi-meet.app.xcent /Users/jenkinsbuild/Library/Developer/Xcode/DerivedData/jitsi-meet-hbqumcnhzlykisdvlutciopijbco/Build/Intermediates.noindex/ArchiveIntermediates/JitsiMeet/InstallationBuildProductsLocation/Applications/jitsi-meet.app
12:25:46  
12:25:46  ValidateEmbeddedBinary /Users/jenkinsbuild/Library/Developer/Xcode/DerivedData/jitsi-meet-hbqumcnhzlykisdvlutciopijbco/Build/Intermediates.noindex/ArchiveIntermediates/JitsiMeet/InstallationBuildProductsLocation/Applications/jitsi-meet.app/PlugIns/JitsiMeetBroadcast\ Extension.appex (in target 'JitsiMeet' from project 'app')
12:25:46      cd /Users/jenkinsbuild/jenkins-dss/workspace/72_bip-meet_sprint6_upgradeBuild/ios/app
12:25:46      /Applications/Xcode12.0.app/Contents/Developer/usr/bin/embeddedBinaryValidationUtility /Users/jenkinsbuild/Library/Developer/Xcode/DerivedData/jitsi-meet-hbqumcnhzlykisdvlutciopijbco/Build/Intermediates.noindex/ArchiveIntermediates/JitsiMeet/InstallationBuildProductsLocation/Applications/jitsi-meet.app/PlugIns/JitsiMeetBroadcast\ Extension.appex -signing-cert 571934C617E6AA93AABFC534D5B2EB0A68629D95 -info-plist-path /Users/jenkinsbuild/Library/Developer/Xcode/DerivedData/jitsi-meet-hbqumcnhzlykisdvlutciopijbco/Build/Intermediates.noindex/ArchiveIntermediates/JitsiMeet/InstallationBuildProductsLocation/Applications/jitsi-meet.app/Info.plist
12:25:47  2021-11-16 12:25:47.887 embeddedBinaryValidationUtility[5722:28985502]  DVTProvisioningProfileManager: Failed to load profile "/Users/jenkinsbuild/Library/MobileDevice/Provisioning Profiles/deleted_provision_profiles.txt" (Error Domain=DVTProvisioningProfileSourceErrorDomain Code=0 "No provisioning profile provider found for profile "/Users/jenkinsbuild/Library/MobileDevice/Provisioning Profiles/deleted_provision_profiles.txt"." UserInfo={NSLocalizedDescription=No provisioning profile provider found for profile "/Users/jenkinsbuild/Library/MobileDevice/Provisioning Profiles/deleted_provision_profiles.txt".})
12:25:48  
12:25:48  ValidateEmbeddedBinary /Users/jenkinsbuild/jenkins-dss/workspace/72_bip-meet_sprint6_upgradeBuild/build/ReleaseEnt-iphoneos/jitsi-meet.app/Watch/JitsiMeetCompanion.app (in target 'JitsiMeet' from project 'app')
12:25:48      cd /Users/jenkinsbuild/jenkins-dss/workspace/72_bip-meet_sprint6_upgradeBuild/ios/app
12:25:48      /Applications/Xcode12.0.app/Contents/Developer/usr/bin/embeddedBinaryValidationUtility /Users/jenkinsbuild/jenkins-dss/workspace/72_bip-meet_sprint6_upgradeBuild/build/ReleaseEnt-iphoneos/jitsi-meet.app/Watch/JitsiMeetCompanion.app -signing-cert 571934C617E6AA93AABFC534D5B2EB0A68629D95 -info-plist-path /Users/jenkinsbuild/Library/Developer/Xcode/DerivedData/jitsi-meet-hbqumcnhzlykisdvlutciopijbco/Build/Intermediates.noindex/ArchiveIntermediates/JitsiMeet/InstallationBuildProductsLocation/Applications/jitsi-meet.app/Info.plist
12:25:48  2021-11-16 12:25:47.080 embeddedBinaryValidationUtility[5723:28985489]  DVTProvisioningProfileManager: Failed to load profile "/Users/jenkinsbuild/Library/MobileDevice/Provisioning Profiles/deleted_provision_profiles.txt" (Error Domain=DVTProvisioningProfileSourceErrorDomain Code=0 "No provisioning profile provider found for profile "/Users/jenkinsbuild/Library/MobileDevice/Provisioning Profiles/deleted_provision_profiles.txt"." UserInfo={NSLocalizedDescription=No provisioning profile provider found for profile "/Users/jenkinsbuild/Library/MobileDevice/Provisioning Profiles/deleted_provision_profiles.txt".})
12:25:48  
12:25:48  RegisterExecutionPolicyException /Users/jenkinsbuild/Library/Developer/Xcode/DerivedData/jitsi-meet-hbqumcnhzlykisdvlutciopijbco/Build/Intermediates.noindex/ArchiveIntermediates/JitsiMeet/InstallationBuildProductsLocation/Applications/jitsi-meet.app (in target 'JitsiMeet' from project 'app')
12:25:48      cd /Users/jenkinsbuild/jenkins-dss/workspace/72_bip-meet_sprint6_upgradeBuild/ios/app
12:25:48      builtin-RegisterExecutionPolicyException /Users/jenkinsbuild/Library/Developer/Xcode/DerivedData/jitsi-meet-hbqumcnhzlykisdvlutciopijbco/Build/Intermediates.noindex/ArchiveIntermediates/JitsiMeet/InstallationBuildProductsLocation/Applications/jitsi-meet.app
12:25:48  
12:25:48  Validate /Users/jenkinsbuild/Library/Developer/Xcode/DerivedData/jitsi-meet-hbqumcnhzlykisdvlutciopijbco/Build/Intermediates.noindex/ArchiveIntermediates/JitsiMeet/InstallationBuildProductsLocation/Applications/jitsi-meet.app (in target 'JitsiMeet' from project 'app')
12:25:48      cd /Users/jenkinsbuild/jenkins-dss/workspace/72_bip-meet_sprint6_upgradeBuild/ios/app
12:25:48      builtin-validationUtility /Users/jenkinsbuild/Library/Developer/Xcode/DerivedData/jitsi-meet-hbqumcnhzlykisdvlutciopijbco/Build/Intermediates.noindex/ArchiveIntermediates/JitsiMeet/InstallationBuildProductsLocation/Applications/jitsi-meet.app
12:25:48  
12:25:48  Touch /Users/jenkinsbuild/Library/Developer/Xcode/DerivedData/jitsi-meet-hbqumcnhzlykisdvlutciopijbco/Build/Intermediates.noindex/ArchiveIntermediates/JitsiMeet/InstallationBuildProductsLocation/Applications/jitsi-meet.app (in target 'JitsiMeet' from project 'app')
12:25:48      cd /Users/jenkinsbuild/jenkins-dss/workspace/72_bip-meet_sprint6_upgradeBuild/ios/app
12:25:48      /usr/bin/touch -c /Users/jenkinsbuild/Library/Developer/Xcode/DerivedData/jitsi-meet-hbqumcnhzlykisdvlutciopijbco/Build/Intermediates.noindex/ArchiveIntermediates/JitsiMeet/InstallationBuildProductsLocation/Applications/jitsi-meet.app
12:25:48  
12:25:48  ** ARCHIVE SUCCEEDED **
12:25:48  
12:25:48  Cleaning up previously generated .ipa files
12:25:48  Cleaning up previously generated .dSYM.zip files
12:25:48  Packaging IPA
12:25:48  [ios] $ /bin/sh -c '/usr/libexec/PlistBuddy -c "Print :UUID" /dev/stdin <<< $(/usr/bin/security cms -D -i "/Users/jenkinsbuild/jenkins-dss/workspace/72_bip-meet_sprint6_upgradeBuild/ios/app/profiles/com_bipmeet.mobileprovision")'
12:25:48  Provisioning UUID is replaced with: 3afab3b6-66b9-43bc-b145-b6d080108484
12:25:48  [ios] $ /bin/sh -c '/usr/libexec/PlistBuddy -c "Print :UUID" /dev/stdin <<< $(/usr/bin/security cms -D -i "/Users/jenkinsbuild/jenkins-dss/workspace/72_bip-meet_sprint6_upgradeBuild/ios/app/profiles/com_bipmeet_broadcast_extension.mobileprovision")'
12:25:48  Provisioning UUID is replaced with: b6cc30aa-b28f-40e7-8c4a-14418868f3cd
12:25:48  [ios] $ /bin/sh -c '/usr/libexec/PlistBuddy -c "Print :UUID" /dev/stdin <<< $(/usr/bin/security cms -D -i "/Users/jenkinsbuild/jenkins-dss/workspace/72_bip-meet_sprint6_upgradeBuild/ios/app/profiles/com_bipmeet_watchkit.mobileprovision")'
12:25:48  Provisioning UUID is replaced with: 138af805-51ac-48c7-9547-2560e63ad854
12:25:48  [ios] $ /bin/sh -c '/usr/libexec/PlistBuddy -c "Print :UUID" /dev/stdin <<< $(/usr/bin/security cms -D -i "/Users/jenkinsbuild/jenkins-dss/workspace/72_bip-meet_sprint6_upgradeBuild/ios/app/profiles/com_bipmeet_watchkit_extension.mobileprovision")'
12:25:48  Provisioning UUID is replaced with: bf460f83-2eb3-49c5-a39b-cc6720fcd695
12:25:48  [ios] $ /bin/sh -c '/usr/libexec/PlistBuddy -c "Print :UUID" /dev/stdin <<< $(/usr/bin/security cms -D -i "/Users/jenkinsbuild/jenkins-dss/workspace/72_bip-meet_sprint6_upgradeBuild/ios/app/profiles/com_turkcell_bipmeetent.mobileprovision")'
12:25:48  Provisioning UUID is replaced with: 15f79446-fde9-4e8c-bef4-970afc6c3f65
12:25:48  [ios] $ /bin/sh -c '/usr/libexec/PlistBuddy -c "Print :UUID" /dev/stdin <<< $(/usr/bin/security cms -D -i "/Users/jenkinsbuild/jenkins-dss/workspace/72_bip-meet_sprint6_upgradeBuild/ios/app/profiles/com_turkcell_bipmeetent_broadcast_extension.mobileprovision")'
12:25:48  Provisioning UUID is replaced with: f9a702f1-344d-41ae-96fb-fb8dc3035112
12:25:48  [ios] $ /bin/sh -c '/usr/libexec/PlistBuddy -c "Print :UUID" /dev/stdin <<< $(/usr/bin/security cms -D -i "/Users/jenkinsbuild/jenkins-dss/workspace/72_bip-meet_sprint6_upgradeBuild/ios/app/profiles/com_turkcell_bipmeetent_watchkit.mobileprovision")'
12:25:49  Provisioning UUID is replaced with: c045b6b2-8411-46a6-ae80-90eaa55282d3
12:25:48  [ios] $ /bin/sh -c '/usr/libexec/PlistBuddy -c "Print :UUID" /dev/stdin <<< $(/usr/bin/security cms -D -i "/Users/jenkinsbuild/jenkins-dss/workspace/72_bip-meet_sprint6_upgradeBuild/ios/app/profiles/com_turkcell_bipmeetent_watchkit_extension.mobileprovision")'
12:25:49  Provisioning UUID is replaced with: c5a408ca-a222-42fc-b325-e3382a578d7a
12:25:49  [ios] $ /usr/libexec/PlistBuddy -c "Print :ApplicationProperties:CFBundleVersion" /Users/jenkinsbuild/jenkins-dss/workspace/72_bip-meet_sprint6_upgradeBuild/build/JitsiMeet.xcarchive/Info.plist
12:25:49  [ios] $ /usr/libexec/PlistBuddy -c "Print :ApplicationProperties:CFBundleShortVersionString" /Users/jenkinsbuild/jenkins-dss/workspace/72_bip-meet_sprint6_upgradeBuild/build/JitsiMeet.xcarchive/Info.plist
12:25:49  Packaging JitsiMeet.xcarchive => /Users/jenkinsbuild/jenkins-dss/workspace/72_bip-meet_sprint6_upgradeBuild/build/bip-meet-12-ReleaseEnt.ipa
12:25:49  [ios] $ /usr/bin/xcodebuild -exportArchive -archivePath /Users/jenkinsbuild/jenkins-dss/workspace/72_bip-meet_sprint6_upgradeBuild/build/JitsiMeet.xcarchive -exportPath /Users/jenkinsbuild/jenkins-dss/workspace/72_bip-meet_sprint6_upgradeBuild/build -exportOptionsPlist /Users/jenkinsbuild/jenkins-dss/workspace/72_bip-meet_sprint6_upgradeBuild/build/enterpriseLA4DZFY7SYExportOptions.plist
12:25:49  2021-11-16 12:25:49.795 xcodebuild[5777:28985890] [MT] IDEDistribution: -[IDEDistributionLogging _createLoggingBundleAtPath:]: Created bundle at path '/var/folders/ts/nt6n9ns94nj7pd8042csjkhjb6q8tn/T/JitsiMeet_2021-11-16_12-25-49.794.xcdistributionlogs'.
12:25:49  2021-11-16 12:25:49.808 xcodebuild[5777:28985977]  DVTProvisioningProfileManager: Failed to load profile "/Users/jenkinsbuild/Library/MobileDevice/Provisioning Profiles/deleted_provision_profiles.txt" (Error Domain=DVTProvisioningProfileSourceErrorDomain Code=0 "No provisioning profile provider found for profile "/Users/jenkinsbuild/Library/MobileDevice/Provisioning Profiles/deleted_provision_profiles.txt"." UserInfo={NSLocalizedDescription=No provisioning profile provider found for profile "/Users/jenkinsbuild/Library/MobileDevice/Provisioning Profiles/deleted_provision_profiles.txt".})
12:28:32  error: exportArchive: ipatool failed with an exception: #<CmdSpec::NonZeroExitException: $ /Applications/Xcode12.0.app/Contents/Developer/usr/bin/python3 /Applications/Xcode12.0.app/Contents/Developer/usr/bin/bitcode-build-tool -v -t /Applications/Xcode12.0.app/Contents/Developer/Toolchains/XcodeDefault.xctoolchain/usr/bin --sdk /Applications/Xcode12.0.app/Contents/Developer/Platforms/iPhoneOS.platform/Developer/SDKs/iPhoneOS14.0.sdk -o /var/folders/ts/nt6n9ns94nj7pd8042csjkhjb6q8tn/T/ipatool20211116-5817-f0sqc4/thinned-out/arm64/Payload/jitsi-meet.app/Frameworks/WebRTC.framework/WebRTC --generate-dsym /var/folders/ts/nt6n9ns94nj7pd8042csjkhjb6q8tn/T/ipatool20211116-5817-f0sqc4/thinned-out/arm64/Payload/jitsi-meet.app/Frameworks/WebRTC.framework/WebRTC.dSYM --strip-swift-symbols /var/folders/ts/nt6n9ns94nj7pd8042csjkhjb6q8tn/T/ipatool20211116-5817-f0sqc4/thinned-in/arm64/Payload/jitsi-meet.app/Frameworks/WebRTC.framework/WebRTC
12:28:32  Status: pid 9570 exit 1
12:28:32  Stdout:
12:28:32      SDK path: /Applications/Xcode12.0.app/Contents/Developer/Platforms/iPhoneOS.platform/Developer/SDKs/iPhoneOS14.0.sdk
12:28:32      SDK version: 14.0
12:28:32      PATH: ['/Applications/Xcode12.0.app/Contents/Developer/Toolchains/XcodeDefault.xctoolchain/usr/bin', '/Applications/Xcode12.0.app/Contents/Developer/usr/bin']
12:28:32      Using: /Applications/Xcode12.0.app/Contents/Developer/Toolchains/XcodeDefault.xctoolchain/usr/bin/lipo
12:28:32      MachoInfo: cd /
12:28:32       ['/Applications/Xcode12.0.app/Contents/Developer/Toolchains/XcodeDefault.xctoolchain/usr/bin/lipo', '-info', '/var/folders/ts/nt6n9ns94nj7pd8042csjkhjb6q8tn/T/ipatool20211116-5817-f0sqc4/thinned-in/arm64/Payload/jitsi-meet.app/Frameworks/WebRTC.framework/WebRTC']
12:28:32      -= Output =-
12:28:32      Non-fat file: /var/folders/ts/nt6n9ns94nj7pd8042csjkhjb6q8tn/T/ipatool20211116-5817-f0sqc4/thinned-in/arm64/Payload/jitsi-meet.app/Frameworks/WebRTC.framework/WebRTC is architecture: arm64
12:28:32      Exited with 0
12:28:32      
12:28:32      Command took 0 seconds
12:28:32      Using: /Applications/Xcode12.0.app/Contents/Developer/Toolchains/XcodeDefault.xctoolchain/usr/bin/dwarfdump
12:28:32      GetUUID: cd /
12:28:32       ['/Applications/Xcode12.0.app/Contents/Developer/Toolchains/XcodeDefault.xctoolchain/usr/bin/dwarfdump', '-u', '/var/folders/ts/nt6n9ns94nj7pd8042csjkhjb6q8tn/T/ipatool20211116-5817-f0sqc4/thinned-in/arm64/Payload/jitsi-meet.app/Frameworks/WebRTC.framework/WebRTC']
12:28:32      -= Output =-
12:28:32      UUID: B7E1978B-40AC-3DCA-A0AA-995C1C5B57AA (arm64) /var/folders/ts/nt6n9ns94nj7pd8042csjkhjb6q8tn/T/ipatool20211116-5817-f0sqc4/thinned-in/arm64/Payload/jitsi-meet.app/Frameworks/WebRTC.framework/WebRTC
12:28:32      Exited with 0
12:28:32      
12:28:32      Command took 0 seconds
12:28:32      Using: /Applications/Xcode12.0.app/Contents/Developer/Toolchains/XcodeDefault.xctoolchain/usr/bin/segedit
12:28:32      ExtractXAR: cd /
12:28:32       ['/Applications/Xcode12.0.app/Contents/Developer/Toolchains/XcodeDefault.xctoolchain/usr/bin/segedit', '/var/folders/ts/nt6n9ns94nj7pd8042csjkhjb6q8tn/T/ipatool20211116-5817-f0sqc4/thinned-in/arm64/Payload/jitsi-meet.app/Frameworks/WebRTC.framework/WebRTC', '-extract', '__LLVM', '__bundle', '/var/folders/ts/nt6n9ns94nj7pd8042csjkhjb6q8tn/T/WebRTCj2_1zwzk/WebRTC.arm64.xar']
12:28:32      -= Output =-
12:28:32      Exited with 0
12:28:32      
12:28:32      Command took 2 seconds
12:28:32      Bitcode bundle version: 1.0
12:28:32      Setting platform to: iOS
12:28:32      Using: /Applications/Xcode12.0.app/Contents/Developer/Toolchains/XcodeDefault.xctoolchain/usr/bin/ld
12:28:32      Using: /Applications/Xcode12.0.app/Contents/Developer/Toolchains/XcodeDefault.xctoolchain/usr/bin/clang
12:28:32      Clang option verification failed for bitcode 0001 (unrecognized arguments: -cc1 -fvisibility-inlines-hidden-static-local-var)
12:28:32  
12:28:32  Stderr:
12:28:32  
12:28:32  >
12:28:32      /Applications/Xcode12.0.app/Contents/Developer/usr/bin/ipatool:373:in `run'
12:28:32      /Applications/Xcode12.0.app/Contents/Developer/usr/bin/ipatool:2808:in `block in CompileOrStripBitcodeInBundle'
12:28:32      /Applications/Xcode12.0.app/Contents/Developer/usr/bin/ipatool:2747:in `each'
12:28:32      /Applications/Xcode12.0.app/Contents/Developer/usr/bin/ipatool:2747:in `CompileOrStripBitcodeInBundle'
12:28:32      /Applications/Xcode12.0.app/Contents/Developer/usr/bin/ipatool:3016:in `block in ProcessIPA'
12:28:32      /Applications/Xcode12.0.app/Contents/Developer/usr/bin/ipatool:2978:in `each'
12:28:32      /Applications/Xcode12.0.app/Contents/Developer/usr/bin/ipatool:2978:in `ProcessIPA'
12:28:32      /Applications/Xcode12.0.app/Contents/Developer/usr/bin/ipatool:3928:in `<main>'
12:28:32  
12:28:32  Error Domain=IDEFoundationErrorDomain Code=1 "ipatool failed with an exception: #<CmdSpec::NonZeroExitException: $ /Applications/Xcode12.0.app/Contents/Developer/usr/bin/python3 /Applications/Xcode12.0.app/Contents/Developer/usr/bin/bitcode-build-tool -v -t /Applications/Xcode12.0.app/Contents/Developer/Toolchains/XcodeDefault.xctoolchain/usr/bin --sdk /Applications/Xcode12.0.app/Contents/Developer/Platforms/iPhoneOS.platform/Developer/SDKs/iPhoneOS14.0.sdk -o /var/folders/ts/nt6n9ns94nj7pd8042csjkhjb6q8tn/T/ipatool20211116-5817-f0sqc4/thinned-out/arm64/Payload/jitsi-meet.app/Frameworks/WebRTC.framework/WebRTC --generate-dsym /var/folders/ts/nt6n9ns94nj7pd8042csjkhjb6q8tn/T/ipatool20211116-5817-f0sqc4/thinned-out/arm64/Payload/jitsi-meet.app/Frameworks/WebRTC.framework/WebRTC.dSYM --strip-swift-symbols /var/folders/ts/nt6n9ns94nj7pd8042csjkhjb6q8tn/T/ipatool20211116-5817-f0sqc4/thinned-in/arm64/Payload/jitsi-meet.app/Frameworks/WebRTC.framework/WebRTC
12:28:32  Status: pid 9570 exit 1
12:28:32  Stdout:
12:28:32      SDK path: /Applications/Xcode12.0.app/Contents/Developer/Platforms/iPhoneOS.platform/Developer/SDKs/iPhoneOS14.0.sdk
12:28:32      SDK version: 14.0
12:28:32      PATH: ['/Applications/Xcode12.0.app/Contents/Developer/Toolchains/XcodeDefault.xctoolchain/usr/bin', '/Applications/Xcode12.0.app/Contents/Developer/usr/bin']
12:28:32      Using: /Applications/Xcode12.0.app/Contents/Developer/Toolchains/XcodeDefault.xctoolchain/usr/bin/lipo
12:28:32      MachoInfo: cd /
12:28:32       ['/Applications/Xcode12.0.app/Contents/Developer/Toolchains/XcodeDefault.xctoolchain/usr/bin/lipo', '-info', '/var/folders/ts/nt6n9ns94nj7pd8042csjkhjb6q8tn/T/ipatool20211116-5817-f0sqc4/thinned-in/arm64/Payload/jitsi-meet.app/Frameworks/WebRTC.framework/WebRTC']
12:28:32      -= Output =-
12:28:32      Non-fat file: /var/folders/ts/nt6n9ns94nj7pd8042csjkhjb6q8tn/T/ipatool20211116-5817-f0sqc4/thinned-in/arm64/Payload/jitsi-meet.app/Frameworks/WebRTC.framework/WebRTC is architecture: arm64
12:28:32      Exited with 0
12:28:32      
12:28:32      Command took 0 seconds
12:28:32      Using: /Applications/Xcode12.0.app/Contents/Developer/Toolchains/XcodeDefault.xctoolchain/usr/bin/dwarfdump
12:28:32      GetUUID: cd /
12:28:32       ['/Applications/Xcode12.0.app/Contents/Developer/Toolchains/XcodeDefault.xctoolchain/usr/bin/dwarfdump', '-u', '/var/folders/ts/nt6n9ns94nj7pd8042csjkhjb6q8tn/T/ipatool20211116-5817-f0sqc4/thinned-in/arm64/Payload/jitsi-meet.app/Frameworks/WebRTC.framework/WebRTC']
12:28:32      -= Output =-
12:28:32      UUID: B7E1978B-40AC-3DCA-A0AA-995C1C5B57AA (arm64) /var/folders/ts/nt6n9ns94nj7pd8042csjkhjb6q8tn/T/ipatool20211116-5817-f0sqc4/thinned-in/arm64/Payload/jitsi-meet.app/Frameworks/WebRTC.framework/WebRTC
12:28:32      Exited with 0
12:28:32      
12:28:32      Command took 0 seconds
12:28:32      Using: /Applications/Xcode12.0.app/Contents/Developer/Toolchains/XcodeDefault.xctoolchain/usr/bin/segedit
12:28:32      ExtractXAR: cd /
12:28:32       ['/Applications/Xcode12.0.app/Contents/Developer/Toolchains/XcodeDefault.xctoolchain/usr/bin/segedit', '/var/folders/ts/nt6n9ns94nj7pd8042csjkhjb6q8tn/T/ipatool20211116-5817-f0sqc4/thinned-in/arm64/Payload/jitsi-meet.app/Frameworks/WebRTC.framework/WebRTC', '-extract', '__LLVM', '__bundle', '/var/folders/ts/nt6n9ns94nj7pd8042csjkhjb6q8tn/T/WebRTCj2_1zwzk/WebRTC.arm64.xar']
12:28:32      -= Output =-
12:28:32      Exited with 0
12:28:32      
12:28:32      Command took 2 seconds
12:28:32      Bitcode bundle version: 1.0
12:28:32      Setting platform to: iOS
12:28:32      Using: /Applications/Xcode12.0.app/Contents/Developer/Toolchains/XcodeDefault.xctoolchain/usr/bin/ld
12:28:32      Using: /Applications/Xcode12.0.app/Contents/Developer/Toolchains/XcodeDefault.xctoolchain/usr/bin/clang
12:28:32      Clang option verification failed for bitcode 0001 (unrecognized arguments: -cc1 -fvisibility-inlines-hidden-static-local-var)
12:28:32  
12:28:32  Stderr:
12:28:32  
12:28:32  >
12:28:32      /Applications/Xcode12.0.app/Contents/Developer/usr/bin/ipatool:373:in `run'
12:28:32      /Applications/Xcode12.0.app/Contents/Developer/usr/bin/ipatool:2808:in `block in CompileOrStripBitcodeInBundle'
12:28:32      /Applications/Xcode12.0.app/Contents/Developer/usr/bin/ipatool:2747:in `each'
12:28:32      /Applications/Xcode12.0.app/Contents/Developer/usr/bin/ipatool:2747:in `CompileOrStripBitcodeInBundle'
12:28:32      /Applications/Xcode12.0.app/Contents/Developer/usr/bin/ipatool:3016:in `block in ProcessIPA'
12:28:32      /Applications/Xcode12.0.app/Contents/Developer/usr/bin/ipatool:2978:in `each'
12:28:32      /Applications/Xcode12.0.app/Contents/Developer/usr/bin/ipatool:2978:in `ProcessIPA'
12:28:32      /Applications/Xcode12.0.app/Contents/Developer/usr/bin/ipatool:3928:in `<main>'" UserInfo={NSLocalizedDescription=ipatool failed with an exception: #<CmdSpec::NonZeroExitException: $ /Applications/Xcode12.0.app/Contents/Developer/usr/bin/python3 /Applications/Xcode12.0.app/Contents/Developer/usr/bin/bitcode-build-tool -v -t /Applications/Xcode12.0.app/Contents/Developer/Toolchains/XcodeDefault.xctoolchain/usr/bin --sdk /Applications/Xcode12.0.app/Contents/Developer/Platforms/iPhoneOS.platform/Developer/SDKs/iPhoneOS14.0.sdk -o /var/folders/ts/nt6n9ns94nj7pd8042csjkhjb6q8tn/T/ipatool20211116-5817-f0sqc4/thinned-out/arm64/Payload/jitsi-meet.app/Frameworks/WebRTC.framework/WebRTC --generate-dsym /var/folders/ts/nt6n9ns94nj7pd8042csjkhjb6q8tn/T/ipatool20211116-5817-f0sqc4/thinned-out/arm64/Payload/jitsi-meet.app/Frameworks/WebRTC.framework/WebRTC.dSYM --strip-swift-symbols /var/folders/ts/nt6n9ns94nj7pd8042csjkhjb6q8tn/T/ipatool20211116-5817-f0sqc4/thinned-in/arm64/Payload/jitsi-meet.app/Frameworks/WebRTC.framework/WebRTC
12:28:32  Status: pid 9570 exit 1
12:28:32  Stdout:
12:28:32      SDK path: /Applications/Xcode12.0.app/Contents/Developer/Platforms/iPhoneOS.platform/Developer/SDKs/iPhoneOS14.0.sdk
12:28:32      SDK version: 14.0
12:28:32      PATH: ['/Applications/Xcode12.0.app/Contents/Developer/Toolchains/XcodeDefault.xctoolchain/usr/bin', '/Applications/Xcode12.0.app/Contents/Developer/usr/bin']
12:28:32      Using: /Applications/Xcode12.0.app/Contents/Developer/Toolchains/XcodeDefault.xctoolchain/usr/bin/lipo
12:28:32      MachoInfo: cd /
12:28:32       ['/Applications/Xcode12.0.app/Contents/Developer/Toolchains/XcodeDefault.xctoolchain/usr/bin/lipo', '-info', '/var/folders/ts/nt6n9ns94nj7pd8042csjkhjb6q8tn/T/ipatool20211116-5817-f0sqc4/thinned-in/arm64/Payload/jitsi-meet.app/Frameworks/WebRTC.framework/WebRTC']
12:28:32      -= Output =-
12:28:32      Non-fat file: /var/folders/ts/nt6n9ns94nj7pd8042csjkhjb6q8tn/T/ipatool20211116-5817-f0sqc4/thinned-in/arm64/Payload/jitsi-meet.app/Frameworks/WebRTC.framework/WebRTC is architecture: arm64
12:28:32      Exited with 0
12:28:32      
12:28:32      Command took 0 seconds
12:28:32      Using: /Applications/Xcode12.0.app/Contents/Developer/Toolchains/XcodeDefault.xctoolchain/usr/bin/dwarfdump
12:28:32      GetUUID: cd /
12:28:32       ['/Applications/Xcode12.0.app/Contents/Developer/Toolchains/XcodeDefault.xctoolchain/usr/bin/dwarfdump', '-u', '/var/folders/ts/nt6n9ns94nj7pd8042csjkhjb6q8tn/T/ipatool20211116-5817-f0sqc4/thinned-in/arm64/Payload/jitsi-meet.app/Frameworks/WebRTC.framework/WebRTC']
12:28:32      -= Output =-
12:28:32      UUID: B7E1978B-40AC-3DCA-A0AA-995C1C5B57AA (arm64) /var/folders/ts/nt6n9ns94nj7pd8042csjkhjb6q8tn/T/ipatool20211116-5817-f0sqc4/thinned-in/arm64/Payload/jitsi-meet.app/Frameworks/WebRTC.framework/WebRTC
12:28:32      Exited with 0
12:28:32      
12:28:32      Command took 0 seconds
12:28:32      Using: /Applications/Xcode12.0.app/Contents/Developer/Toolchains/XcodeDefault.xctoolchain/usr/bin/segedit
12:28:32      ExtractXAR: cd /
12:28:32       ['/Applications/Xcode12.0.app/Contents/Developer/Toolchains/XcodeDefault.xctoolchain/usr/bin/segedit', '/var/folders/ts/nt6n9ns94nj7pd8042csjkhjb6q8tn/T/ipatool20211116-5817-f0sqc4/thinned-in/arm64/Payload/jitsi-meet.app/Frameworks/WebRTC.framework/WebRTC', '-extract', '__LLVM', '__bundle', '/var/folders/ts/nt6n9ns94nj7pd8042csjkhjb6q8tn/T/WebRTCj2_1zwzk/WebRTC.arm64.xar']
12:28:32      -= Output =-
12:28:32      Exited with 0
12:28:32      
12:28:32      Command took 2 seconds
12:28:32      Bitcode bundle version: 1.0
12:28:32      Setting platform to: iOS
12:28:32      Using: /Applications/Xcode12.0.app/Contents/Developer/Toolchains/XcodeDefault.xctoolchain/usr/bin/ld
12:28:32      Using: /Applications/Xcode12.0.app/Contents/Developer/Toolchains/XcodeDefault.xctoolchain/usr/bin/clang
12:28:32      Clang option verification failed for bitcode 0001 (unrecognized arguments: -cc1 -fvisibility-inlines-hidden-static-local-var)
12:28:32  
12:28:32  Stderr:
12:28:32  
12:28:32  >
12:28:32      /Applications/Xcode12.0.app/Contents/Developer/usr/bin/ipatool:373:in `run'
12:28:32      /Applications/Xcode12.0.app/Contents/Developer/usr/bin/ipatool:2808:in `block in CompileOrStripBitcodeInBundle'
12:28:32      /Applications/Xcode12.0.app/Contents/Developer/usr/bin/ipatool:2747:in `each'
12:28:32      /Applications/Xcode12.0.app/Contents/Developer/usr/bin/ipatool:2747:in `CompileOrStripBitcodeInBundle'
12:28:32      /Applications/Xcode12.0.app/Contents/Developer/usr/bin/ipatool:3016:in `block in ProcessIPA'
12:28:32      /Applications/Xcode12.0.app/Contents/Developer/usr/bin/ipatool:2978:in `each'
12:28:32      /Applications/Xcode12.0.app/Contents/Developer/usr/bin/ipatool:2978:in `ProcessIPA'
12:28:32      /Applications/Xcode12.0.app/Contents/Developer/usr/bin/ipatool:3928:in `<main>'}
12:28:32  
12:28:32  ** EXPORT FAILED **
12:28:32  
12:28:32  Failed to build /Users/jenkinsbuild/jenkins-dss/workspace/72_bip-meet_sprint6_upgradeBuild/build/bip-meet-12-ReleaseEnt.ipa
[Pipeline] archiveArtifacts
12:28:32  Archiving artifacts
[Pipeline] }
[Pipeline] // stage
[Pipeline] }
[Pipeline] // script
[Pipeline] }
[Pipeline] // withEnv
[Pipeline] }
[Pipeline] // withCredentials
[Pipeline] }
[Pipeline] // node
[Pipeline] }
[Pipeline] // timeout
[Pipeline] }
[Pipeline] // stage
[Pipeline] stage
[Pipeline] { (Approve Deploy to Testflight)
Stage "Approve Deploy to Testflight" skipped due to earlier failure(s)
[Pipeline] }
[Pipeline] // stage
[Pipeline] stage
[Pipeline] { (Deploy to Testflight)
Stage "Deploy to Testflight" skipped due to earlier failure(s)
[Pipeline] }
[Pipeline] // stage
[Pipeline] }
[Pipeline] // timestamps
[Pipeline] End of Pipeline
[Bitbucket] Notifying commit build result
[Bitbucket] Build result notified
ERROR: xcodebuild failed. Check the logs for details
Finished: FAILURE