Untitled
Anonymous
plain_text
11/02/2023 6:28 AM
7.2 KB
21
Indexable
Build Summary: 11/14 steps succeeded; 1 failed (disable with --summary none)
install transitive failure
└─ install Client transitive failure
└─ zig build-exe Client Debug native 18 errors
src\utils.zig:163:14: error: no field named 'Little' in enum 'builtin.Endian'
.Little => return std.mem.bytesToValue(T, buf[0..byte_size]),
~^~~~~~
C:\Users\Administrator\Desktop\zig-windows-x86_64-0.12.0-dev.1381+61861ef39\lib\std\builtin.zig:452:20: note: enum declared here
pub const Endian = enum {
^~~~
referenced by:
accept: src\network.zig:247:38
networkTick: src\main.zig:149:24
remaining reference traces hidden; use '-freference-trace' to see all reference traces
src\utils.zig:163:14: error: no field named 'Little' in enum 'builtin.Endian'
.Little => return std.mem.bytesToValue(T, buf[0..byte_size]),
~^~~~~~
C:\Users\Administrator\Desktop\zig-windows-x86_64-0.12.0-dev.1381+61861ef39\lib\std\builtin.zig:452:20: note: enum declared here
pub const Endian = enum {
^~~~
src\utils.zig:122:14: error: no field named 'Little' in enum 'builtin.Endian'
.Little => {
~^~~~~~
C:\Users\Administrator\Desktop\zig-windows-x86_64-0.12.0-dev.1381+61861ef39\lib\std\builtin.zig:452:20: note: enum declared here
pub const Endian = enum {
^~~~
src\utils.zig:82:14: error: no field named 'Little' in enum 'builtin.Endian'
.Little => {
~^~~~~~
C:\Users\Administrator\Desktop\zig-windows-x86_64-0.12.0-dev.1381+61861ef39\lib\std\builtin.zig:452:20: note: enum declared here
pub const Endian = enum {
^~~~
src\utils.zig:163:14: error: no field named 'Little' in enum 'builtin.Endian'
.Little => return std.mem.bytesToValue(T, buf[0..byte_size]),
~^~~~~~
C:\Users\Administrator\Desktop\zig-windows-x86_64-0.12.0-dev.1381+61861ef39\lib\std\builtin.zig:452:20: note: enum declared here
pub const Endian = enum {
^~~~
src\utils.zig:163:14: error: no field named 'Little' in enum 'builtin.Endian'
.Little => return std.mem.bytesToValue(T, buf[0..byte_size]),
~^~~~~~
C:\Users\Administrator\Desktop\zig-windows-x86_64-0.12.0-dev.1381+61861ef39\lib\std\builtin.zig:452:20: note: enum declared here
pub const Endian = enum {
^~~~
src\utils.zig:163:14: error: no field named 'Little' in enum 'builtin.Endian'
.Little => return std.mem.bytesToValue(T, buf[0..byte_size]),
~^~~~~~
C:\Users\Administrator\Desktop\zig-windows-x86_64-0.12.0-dev.1381+61861ef39\lib\std\builtin.zig:452:20: note: enum declared here
pub const Endian = enum {
^~~~
src\utils.zig:163:14: error: no field named 'Little' in enum 'builtin.Endian'
.Little => return std.mem.bytesToValue(T, buf[0..byte_size]),
~^~~~~~
C:\Users\Administrator\Desktop\zig-windows-x86_64-0.12.0-dev.1381+61861ef39\lib\std\builtin.zig:452:20: note: enum declared here
pub const Endian = enum {
^~~~
src\utils.zig:163:14: error: no field named 'Little' in enum 'builtin.Endian'
.Little => return std.mem.bytesToValue(T, buf[0..byte_size]),
~^~~~~~
C:\Users\Administrator\Desktop\zig-windows-x86_64-0.12.0-dev.1381+61861ef39\lib\std\builtin.zig:452:20: note: enum declared here
pub const Endian = enum {
^~~~
src\utils.zig:163:14: error: no field named 'Little' in enum 'builtin.Endian'
.Little => return std.mem.bytesToValue(T, buf[0..byte_size]),
~^~~~~~
C:\Users\Administrator\Desktop\zig-windows-x86_64-0.12.0-dev.1381+61861ef39\lib\std\builtin.zig:452:20: note: enum declared here
pub const Endian = enum {
^~~~
src\utils.zig:163:14: error: no field named 'Little' in enum 'builtin.Endian'
.Little => return std.mem.bytesToValue(T, buf[0..byte_size]),
~^~~~~~
C:\Users\Administrator\Desktop\zig-windows-x86_64-0.12.0-dev.1381+61861ef39\lib\std\builtin.zig:452:20: note: enum declared here
pub const Endian = enum {
^~~~
src\utils.zig:163:14: error: no field named 'Little' in enum 'builtin.Endian'
.Little => return std.mem.bytesToValue(T, buf[0..byte_size]),
~^~~~~~
C:\Users\Administrator\Desktop\zig-windows-x86_64-0.12.0-dev.1381+61861ef39\lib\std\builtin.zig:452:20: note: enum declared here
pub const Endian = enum {
^~~~
src\utils.zig:163:14: error: no field named 'Little' in enum 'builtin.Endian'
.Little => return std.mem.bytesToValue(T, buf[0..byte_size]),
~^~~~~~
C:\Users\Administrator\Desktop\zig-windows-x86_64-0.12.0-dev.1381+61861ef39\lib\std\builtin.zig:452:20: note: enum declared here
pub const Endian = enum {
^~~~
src\utils.zig:122:14: error: no field named 'Little' in enum 'builtin.Endian'
.Little => {
~^~~~~~
C:\Users\Administrator\Desktop\zig-windows-x86_64-0.12.0-dev.1381+61861ef39\lib\std\builtin.zig:452:20: note: enum declared here
pub const Endian = enum {
^~~~
src\utils.zig:122:14: error: no field named 'Little' in enum 'builtin.Endian'
.Little => {
~^~~~~~
C:\Users\Administrator\Desktop\zig-windows-x86_64-0.12.0-dev.1381+61861ef39\lib\std\builtin.zig:452:20: note: enum declared here
pub const Endian = enum {
^~~~Editor is loading...