Untitled

mail@pastecode.io avatar
unknown
plain_text
a year ago
68 kB
2
Indexable
Never
Job started: Publish to 'web'|INFO [Deploy] Checking all sites sequentially (2).|INFO [Deploy] Site "aon-preview" is skipped because current publish target database is "web" which differs from site's context database (<site name="aon-preview" ... database="master" ... />)|INFO Uniform service is ready, version: 7.0.220726-1|Items created: 0|Items deleted: 0|Items updated: 8|Items skipped: 2671|INFO [Deploy] Checking all sites sequentially (2).|INFO [Deploy] Starting deployment for site "aon"|INFO Reading timestamp via Azure API '2023-06-15T07:43:38.9974602Z', path: /uniform/api/content/aon/.Aon.7.0.230224-2.timestamp.txt, raw: 2023-06-15T07:43:38.9974602Z|INFO Retrieved 8 event(s) from EventQueue.|INFO Reading timestamp via Azure API '2023-06-15T07:43:38.9974602Z', path: /.aon.media.timestamp.txt, raw: 2023-06-15T07:43:38.9974602Z|INFO Retrieved 8 event(s) from EventQueue.|INFO Starting content and media deployment for site "aon"|INFO Scope.Pages(site: "aon"): 22
- /en/capabilities/health-and-benefits
- /en/capabilities/claims-management
- /en/capabilities/human-capital-analytics
- /en/capabilities/risk-analytics
- /en/t13oursolutionlp/t02-capability
- /en/capabilities/capital-for-insurers
- /en/capabilities/pensions-and-retirement
- /en/capabilities/risk-retention
- /en/capabilities/wellbeing-in-the-workplace
- /en/capabilities/investment-management
- /en/capabilities/talent-and-rewards-consulting
- /en/capabilities/risk-management-consulting
- /en/capabilities/capital-for-corporations
- /en/insights/digital-acceleration
- /en/insights/t03-topic
- /en/insights/t03-topic/t07-article
- /en/capabilities/risk-analytics/cyber-threat-hunt-fresh-page
- /en/capabilities/risk-analytics/cyber-threat-hunt-workshop
- /en/capabilities/risk-analytics/sdf-test
- /en/capabilities/claims-management/cyber-threats
- /en/capabilities/claims-management/adversary-simulation
- /en/t13oursolutionlp/t02-capability/t01-service-detail|INFO Writing timestamp '2023-06-15T07:46:11.0673081Z', URL: https://aonqaxpscaledcntcache.blob.core.windows.net/$web/uniform/api/content/aon/.Aon.7.0.230224-2.timestamp.txt|INFO Reading last successful deployment timestamp '2023-06-15T07:25:06.0757703Z', URL: https://aonqaxpscaledhtml.z20.web.core.windows.net/.Aon.7.0.230224-2.timestamp.txt, raw: 2023-06-15T07:25:06.0757703Z|INFO Retrieved 734 event(s) from EventQueue.|WARN Long running operation: GetPageCandidates, Elapsed: 00:00:02.8809643, Estimation: 00:00:01|WARN Long running operation: Get pages, Elapsed: 00:00:02.8836710, Estimation: 00:00:02|INFO Uniform service is ready, version: 7.0.220726-1|INFO [Deploy] Run external service for aon site.|INFO Deploy is in progress, status: {"status":"In progress","message":"Generating HTML site files","total":46,"time":"2023-06-15T07:46:42.662Z"}|INFO Deploy is in progress, status: {"status":"In progress","message":"Generating HTML site files","total":46,"time":"2023-06-15T07:46:44.686Z"}|INFO Deploy is in progress, status: {"status":"In progress","message":"Generating HTML site files","total":46,"time":"2023-06-15T07:46:46.692Z"}|INFO Deploy is in progress, status: {"status":"In progress","message":"Generating HTML site files","total":46,"time":"2023-06-15T07:46:48.694Z"}|INFO Deploy is in progress, status: {"status":"In progress","message":"Generating HTML site files","total":46,"time":"2023-06-15T07:46:50.700Z"}|INFO Deploy is in progress, status: {"status":"In progress","message":"Generating HTML site files","total":46,"time":"2023-06-15T07:46:52.704Z"}|INFO Deploy is in progress, status: {"status":"In progress","message":"Generating HTML site files","total":46,"time":"2023-06-15T07:46:54.715Z"}|INFO Deploy is in progress, status: {"status":"In progress","message":"Generating HTML site files","total":46,"time":"2023-06-15T07:46:56.720Z"}|INFO Deploy is in progress, status: {"status":"In progress","message":"Generating HTML site files","total":46,"time":"2023-06-15T07:46:58.727Z"}|INFO Deploy is in progress, status: {"status":"In progress","message":"Generating HTML site files","total":46,"time":"2023-06-15T07:47:00.728Z"}|INFO Deploy is in progress, status: {"status":"In progress","message":"Generating HTML site files","total":46,"time":"2023-06-15T07:47:02.729Z"}|INFO Deploy is in progress, status: {"status":"In progress","message":"Generating HTML site files","total":46,"time":"2023-06-15T07:47:04.732Z"}|INFO Deploy is in progress, status: {"status":"In progress","message":"Generating HTML site files","total":46,"time":"2023-06-15T07:47:06.736Z"}|INFO Deploy is in progress, status: {"status":"In progress","message":"Generating HTML site files","total":46,"time":"2023-06-15T07:47:08.740Z"}|INFO Deploy is in progress, status: {"status":"In progress","message":"Generating HTML site files","total":46,"time":"2023-06-15T07:47:10.753Z"}|INFO Deploy is in progress, status: {"status":"In progress","message":"Generating HTML site files","total":46,"time":"2023-06-15T07:47:12.757Z"}|INFO Deploy is in progress, status: {"status":"In progress","message":"Generating HTML site files","total":46,"time":"2023-06-15T07:47:14.765Z"}|INFO Deploy is in progress, status: {"status":"In progress","message":"Generating HTML site files","total":46,"time":"2023-06-15T07:47:16.770Z"}|INFO Deploy is in progress, status: {"status":"In progress","message":"Generating HTML site files","total":46,"time":"2023-06-15T07:47:18.772Z"}|WARN Operation "Failed to deploy 44 pages" has failed. It will retry in 5s|WARN Retrying operation "Failed to deploy 44 pages"|INFO Deploy is in progress, status: {"status":"In progress","message":"Generating HTML site files","total":46,"time":"2023-06-15T07:47:26.550Z"}|INFO Deploy is in progress, status: {"status":"In progress","message":"Generating HTML site files","total":46,"time":"2023-06-15T07:47:28.564Z"}|INFO Deploy is in progress, status: {"status":"In progress","message":"Generating HTML site files","total":46,"time":"2023-06-15T07:47:30.568Z"}|INFO Deploy is in progress, status: {"status":"In progress","message":"Generating HTML site files","total":46,"time":"2023-06-15T07:47:32.572Z"}|INFO Deploy is in progress, status: {"status":"In progress","message":"Generating HTML site files","total":46,"time":"2023-06-15T07:47:34.576Z"}|INFO Deploy is in progress, status: {"status":"In progress","message":"Generating HTML site files","total":46,"time":"2023-06-15T07:47:36.580Z"}|INFO Deploy is in progress, status: {"status":"In progress","message":"Generating HTML site files","total":46,"time":"2023-06-15T07:47:38.584Z"}|INFO Deploy is in progress, status: {"status":"In progress","message":"Generating HTML site files","total":46,"time":"2023-06-15T07:47:40.588Z"}|INFO Deploy is in progress, status: {"status":"In progress","message":"Generating HTML site files","total":46,"time":"2023-06-15T07:47:42.592Z"}|INFO Deploy is in progress, status: {"status":"In progress","message":"Generating HTML site files","total":46,"time":"2023-06-15T07:47:44.600Z"}|INFO Deploy is in progress, status: {"status":"In progress","message":"Generating HTML site files","total":46,"time":"2023-06-15T07:47:46.604Z"}|INFO Deploy is in progress, status: {"status":"In progress","message":"Generating HTML site files","total":46,"time":"2023-06-15T07:47:48.606Z"}|INFO Deploy is in progress, status: {"status":"In progress","message":"Generating HTML site files","total":46,"time":"2023-06-15T07:47:50.612Z"}|INFO Deploy is in progress, status: {"status":"In progress","message":"Generating HTML site files","total":46,"time":"2023-06-15T07:47:52.616Z"}|INFO Deploy is in progress, status: {"status":"In progress","message":"Generating HTML site files","total":46,"time":"2023-06-15T07:47:54.620Z"}|INFO Deploy is in progress, status: {"status":"In progress","message":"Generating HTML site files","total":46,"time":"2023-06-15T07:47:56.622Z"}|INFO Deploy is in progress, status: {"status":"In progress","message":"Generating HTML site files","total":46,"time":"2023-06-15T07:47:58.627Z"}|WARN Operation "Failed to deploy 44 pages" has failed. It will retry in 5s|WARN Retrying operation "Failed to deploy 44 pages"|INFO Deploy is in progress, status: {"status":"In progress","message":"Generating HTML site files","total":46,"time":"2023-06-15T07:48:06.249Z"}|INFO Deploy is in progress, status: {"status":"In progress","message":"Generating HTML site files","total":46,"time":"2023-06-15T07:48:08.272Z"}|INFO Deploy is in progress, status: {"status":"In progress","message":"Generating HTML site files","total":46,"time":"2023-06-15T07:48:10.274Z"}|INFO Deploy is in progress, status: {"status":"In progress","message":"Generating HTML site files","total":46,"time":"2023-06-15T07:48:12.276Z"}|INFO Deploy is in progress, status: {"status":"In progress","message":"Generating HTML site files","total":46,"time":"2023-06-15T07:48:14.279Z"}|INFO Deploy is in progress, status: {"status":"In progress","message":"Generating HTML site files","total":46,"time":"2023-06-15T07:48:16.283Z"}|INFO Deploy is in progress, status: {"status":"In progress","message":"Generating HTML site files","total":46,"time":"2023-06-15T07:48:18.286Z"}|INFO Deploy is in progress, status: {"status":"In progress","message":"Generating HTML site files","total":46,"time":"2023-06-15T07:48:20.289Z"}|INFO Deploy is in progress, status: {"status":"In progress","message":"Generating HTML site files","total":46,"time":"2023-06-15T07:48:22.292Z"}|INFO Deploy is in progress, status: {"status":"In progress","message":"Generating HTML site files","total":46,"time":"2023-06-15T07:48:24.300Z"}|INFO Deploy is in progress, status: {"status":"In progress","message":"Generating HTML site files","total":46,"time":"2023-06-15T07:48:26.300Z"}|INFO Deploy is in progress, status: {"status":"In progress","message":"Generating HTML site files","total":46,"time":"2023-06-15T07:48:28.302Z"}|INFO Deploy is in progress, status: {"status":"In progress","message":"Generating HTML site files","total":46,"time":"2023-06-15T07:48:30.304Z"}|INFO Deploy is in progress, status: {"status":"In progress","message":"Generating HTML site files","total":46,"time":"2023-06-15T07:48:32.312Z"}|INFO Deploy is in progress, status: {"status":"In progress","message":"Generating HTML site files","total":46,"time":"2023-06-15T07:48:34.314Z"}|INFO Deploy is in progress, status: {"status":"In progress","message":"Generating HTML site files","total":46,"time":"2023-06-15T07:48:36.316Z"}|INFO Deploy is in progress, status: {"status":"In progress","message":"Generating HTML site files","total":46,"time":"2023-06-15T07:48:38.320Z"}|WARN Failed to update last usage date statistics counter, name: Error, message: The 'StringValue' should have the size of max 100 chars.|#Exception: System.Reflection.TargetInvocationException: Exception has been thrown by the target of an invocation. ---> System.InvalidOperationException: Deployment got interrupted due to error. This exception may contain sensitive data masked, the original exception is available separately with this log reference: 8DB6D74F05B79F6 ---> System.InvalidOperationException: Failed to deploy aon site ---> System.InvalidOperationException: Publish service job 195 failed, error: {
  "code": 1,
  "killed": false,
  "signal": null,
  "cmd": "node ./scripts/generate-sitemap.js && node node_modules/next/dist/bin/next build && node node_modules/next/dist/bin/next export --outdir \"/home/site/wwwroot/.temp/195/out\"",
  "stdout": "06/04-07:48:11  \u001b[32minfo\u001b[39m: \u001b[32mUniform version: 7.0.220726-1\u001b[39m \n06/04-07:48:11  \u001b[32minfo\u001b[39m: \u001b[32mLoading Uniform config...\u001b[39m \n06/04-07:48:11  \u001b[32minfo\u001b[39m: \u001b[32mpublicRuntimeConfig: {\"UNIFORM_API_URL\":\"https://aonqaxpscaledcntcache.z20.web.core.windows.net\",\"UNIFORM_API_SITENAME\":\"aon\",\"UNIFORM_CONTENT_URL\":\"https://aonqaxpscaledcntcache.z20.web.core.windows.net\",\"UNIFORM_API_MAPSERVICE\":\"/uniform/api/content/${UNIFORM_API_SITENAME}/map\",\"UNIFORM_OPTIONS_PREVIEW\":false,\"UNIFORM_OPTIONS_DEBUG\":false,\"UNIFORM_OPTIONS_PREFETCH_LINKS\":false,\"UNIFORM_OPTIONS_ESI\":true}\u001b[39m \ninfo  - Checking validity of types...\ninfo  - Creating an optimized production build...\ninfo  - Compiled successfully\ninfo  - Collecting page data...\n06/04-07:48:29  \u001b[32minfo\u001b[39m: \u001b[32mParsing .publish-map.json...\u001b[39m \ninfo  - Generating static pages (0/46)\nRendering 1ee6a310e0fe430ea17ac2032ccf5f52 with key doesn't exist in htmlMap {\n  key: '00000000000000000000000000000000|Alignment=%7b24CCA138-3C11-46BE-9951-670AA2855648%7d&CacheClearingBehavior=Clear+on+publish&Id=webinar&Theme=%7b47A0F1D1-2E1A-48D8-8201-C6B8AA3CF202%7d'\n}\nRendering 3f139e6f6706493f810132ba23fa9236 with key doesn't exist in htmlMap { key: '00000000000000000000000000000000|' }\nRendering 3f139e6f6706493f810132ba23fa9236 with key doesn't exist in htmlMap { key: '00000000000000000000000000000000|' }\nRendering 3f139e6f6706493f810132ba23fa9236 with key doesn't exist in htmlMap { key: '00000000000000000000000000000000|' }\ninfo  - Generating static pages (11/46)\nRendering 3f139e6f6706493f810132ba23fa9236 with key doesn't exist in htmlMap { key: '00000000000000000000000000000000|' }\nRendering 14c2534c6d4948c58146a1ed9ca5fbbd with key doesn't exist in htmlMap {\n  key: '00000000000000000000000000000000|CacheClearingBehavior=Clear+on+publish&Theme=%7b7A398181-0A25-4AFB-9893-FC895805B6F6%7d'\n}\nRendering 6b896ab20c25488aaaf603fbfdc7f8eb with key doesn't exist in htmlMap {\n  key: '00000000000000000000000000000000|CacheClearingBehavior=Clear+on+publish'\n}\nRendering bc6bf8d4cd4b4d4aa42aaebb6424117e with key doesn't exist in htmlMap {\n  key: '00000000000000000000000000000000|Mobile+Display=%7b6E50D5E2-04CC-41D2-8A38-F10E89AC4465%7d'\n}\nRendering aa28cebbf32d4431a89d025110ed617b with key doesn't exist in htmlMap { key: '00000000000000000000000000000000|' }\nRendering 1ee6a310e0fe430ea17ac2032ccf5f52 with key doesn't exist in htmlMap {\n  key: '00000000000000000000000000000000|Alignment=%7b24CCA138-3C11-46BE-9951-670AA2855648%7d&Theme=%7b67B98C36-84B8-413C-B729-99D9ED02834C%7d'\n}\nRendering 197fdf0210c146e4a980d2a61756e852 with key doesn't exist in htmlMap { key: '00000000000000000000000000000000|' }\nRendering 63ccc1b5346c4a64b3519281e5d90f6c with key doesn't exist in htmlMap {\n  key: '00000000000000000000000000000000|CacheClearingBehavior=Clear+on+publish'\n}\nRendering bc6bf8d4cd4b4d4aa42aaebb6424117e with key doesn't exist in htmlMap {\n  key: '00000000000000000000000000000000|Mobile+Display=%7b6E50D5E2-04CC-41D2-8A38-F10E89AC4465%7d'\n}\nRendering 013223a73c444f9a8fc16ec30364b830 with key doesn't exist in htmlMap { key: '00000000000000000000000000000000|' }\nRendering 258e2985e4a846da9f3adf79711c4699 with key doesn't exist in htmlMap { key: '00000000000000000000000000000000|' }\nRendering 37151af2fcda4ff18729576ec093c1cb with key doesn't exist in htmlMap { key: '00000000000000000000000000000000|' }\nRendering 32cf6e950e024d3895ab5667409c2b8f with key doesn't exist in htmlMap { key: '00000000000000000000000000000000|' }\nRendering 14c2534c6d4948c58146a1ed9ca5fbbd with key doesn't exist in htmlMap {\n  key: '00000000000000000000000000000000|CacheClearingBehavior=Clear+on+publish&Theme=%7b7A398181-0A25-4AFB-9893-FC895805B6F6%7d'\n}\nRendering 6b896ab20c25488aaaf603fbfdc7f8eb with key doesn't exist in htmlMap {\n  key: '00000000000000000000000000000000|CacheClearingBehavior=Clear+on+publish'\n}\nRendering bc6bf8d4cd4b4d4aa42aaebb6424117e with key doesn't exist in htmlMap {\n  key: '00000000000000000000000000000000|Mobile+Display=%7b6E50D5E2-04CC-41D2-8A38-F10E89AC4465%7d'\n}\nRendering bc6bf8d4cd4b4d4aa42aaebb6424117e with key doesn't exist in htmlMap {\n  key: '00000000000000000000000000000000|Mobile+Display=%7b6E50D5E2-04CC-41D2-8A38-F10E89AC4465%7d'\n}\nRendering 63ccc1b5346c4a64b3519281e5d90f6c with key doesn't exist in htmlMap {\n  key: '00000000000000000000000000000000|CacheClearingBehavior=Clear+on+publish'\n}\nRendering 197fdf0210c146e4a980d2a61756e852 with key doesn't exist in htmlMap {\n  key: '00000000000000000000000000000000|CacheClearingBehavior=Clear+on+publish&Theme=%7b67B98C36-84B8-413C-B729-99D9ED02834C%7d'\n}\nRendering 6b896ab20c25488aaaf603fbfdc7f8eb with key doesn't exist in htmlMap { key: '00000000000000000000000000000000|' }\nRendering bc6bf8d4cd4b4d4aa42aaebb6424117e with key doesn't exist in htmlMap {\n  key: '00000000000000000000000000000000|Mobile+Display=%7b6E50D5E2-04CC-41D2-8A38-F10E89AC4465%7d'\n}\nRendering 013223a73c444f9a8fc16ec30364b830 with key doesn't exist in htmlMap { key: '00000000000000000000000000000000|' }\nRendering 37151af2fcda4ff18729576ec093c1cb with key doesn't exist in htmlMap { key: '00000000000000000000000000000000|' }\nRendering 32cf6e950e024d3895ab5667409c2b8f with key doesn't exist in htmlMap {\n  key: '00000000000000000000000000000000|CacheClearingBehavior=Clear+on+publish&Theme=%7bB07799B5-E238-4B34-9619-1E1A23147B0F%7d'\n}\nRendering bc6bf8d4cd4b4d4aa42aaebb6424117e with key doesn't exist in htmlMap {\n  key: '00000000000000000000000000000000|Mobile+Display=%7b6E50D5E2-04CC-41D2-8A38-F10E89AC4465%7d'\n}\nRendering bc6bf8d4cd4b4d4aa42aaebb6424117e with key doesn't exist in htmlMap {\n  key: '00000000000000000000000000000000|Mobile+Display=%7b6E50D5E2-04CC-41D2-8A38-F10E89AC4465%7d'\n}\nRendering 14c2534c6d4948c58146a1ed9ca5fbbd with key doesn't exist in htmlMap {\n  key: '00000000000000000000000000000000|CacheClearingBehavior=Clear+on+publish&Theme=%7b7A398181-0A25-4AFB-9893-FC895805B6F6%7d'\n}\nRendering 6b896ab20c25488aaaf603fbfdc7f8eb with key doesn't exist in htmlMap {\n  key: '00000000000000000000000000000000|CacheClearingBehavior=Clear+on+publish'\n}\nRendering bc6bf8d4cd4b4d4aa42aaebb6424117e with key doesn't exist in htmlMap {\n  key: '00000000000000000000000000000000|Mobile+Display=%7b6E50D5E2-04CC-41D2-8A38-F10E89AC4465%7d'\n}\nRendering bc6bf8d4cd4b4d4aa42aaebb6424117e with key doesn't exist in htmlMap {\n  key: '00000000000000000000000000000000|Mobile+Display=%7b6E50D5E2-04CC-41D2-8A38-F10E89AC4465%7d'\n}\nRendering 197fdf0210c146e4a980d2a61756e852 with key doesn't exist in htmlMap {\n  key: '00000000000000000000000000000000|CacheClearingBehavior=Clear+on+publish&Theme=%7b67B98C36-84B8-413C-B729-99D9ED02834C%7d'\n}\nRendering 6b896ab20c25488aaaf603fbfdc7f8eb with key doesn't exist in htmlMap { key: '00000000000000000000000000000000|' }\nRendering 63ccc1b5346c4a64b3519281e5d90f6c with key doesn't exist in htmlMap { key: '00000000000000000000000000000000|' }\nRendering 37151af2fcda4ff18729576ec093c1cb with key doesn't exist in htmlMap { key: '00000000000000000000000000000000|' }\nRendering 6b896ab20c25488aaaf603fbfdc7f8eb with key doesn't exist in htmlMap { key: '00000000000000000000000000000000|' }\nRendering bc6bf8d4cd4b4d4aa42aaebb6424117e with key doesn't exist in htmlMap {\n  key: '00000000000000000000000000000000|Mobile+Display=%7b6E50D5E2-04CC-41D2-8A38-F10E89AC4465%7d'\n}\nRendering bc6bf8d4cd4b4d4aa42aaebb6424117e with key doesn't exist in htmlMap {\n  key: '00000000000000000000000000000000|Mobile+Display=%7b6E50D5E2-04CC-41D2-8A38-F10E89AC4465%7d'\n}\nRendering 32cf6e950e024d3895ab5667409c2b8f with key doesn't exist in htmlMap { key: '00000000000000000000000000000000|' }\nRendering bc6bf8d4cd4b4d4aa42aaebb6424117e with key doesn't exist in htmlMap {\n  key: '00000000000000000000000000000000|Mobile+Display=%7b6E50D5E2-04CC-41D2-8A38-F10E89AC4465%7d'\n}\nRendering bc6bf8d4cd4b4d4aa42aaebb6424117e with key doesn't exist in htmlMap {\n  key: '00000000000000000000000000000000|Mobile+Display=%7b6E50D5E2-04CC-41D2-8A38-F10E89AC4465%7d'\n}\ninfo  - Generating static pages (22/46)\nRendering bc6bf8d4cd4b4d4aa42aaebb6424117e with key doesn't exist in htmlMap {\n  key: '00000000000000000000000000000000|Mobile+Display=%7b6E50D5E2-04CC-41D2-8A38-F10E89AC4465%7d'\n}\nRendering 017081666d6a464197942675bd69c6d5 with key doesn't exist in htmlMap { key: '00000000000000000000000000000000|' }\nRendering a7e314ab4f67408abbb2144c01b78c15 with key doesn't exist in htmlMap {\n  key: '00000000000000000000000000000000|CacheClearingBehavior=Clear+on+publish&Theme=%7b67B98C36-84B8-413C-B729-99D9ED02834C%7d'\n}\nRendering 58718a7f53b74e7ca394293e75123243 with key doesn't exist in htmlMap {\n  key: 'aa63dfa7ac264e34b302967c281118ff|CacheClearingBehavior=Clear+on+publish&Id=stat-block&Layout=%7b313AF655-FA87-4E3D-B800-F4B763F417AB%7d&Theme=%7b67B98C36-84B8-413C-B729-99D9ED02834C%7d'\n}\nRendering bc6bf8d4cd4b4d4aa42aaebb6424117e with key doesn't exist in htmlMap {\n  key: '00000000000000000000000000000000|Mobile+Display=%7b6E50D5E2-04CC-41D2-8A38-F10E89AC4465%7d'\n}\nRendering 017081666d6a464197942675bd69c6d5 with key doesn't exist in htmlMap { key: '00000000000000000000000000000000|' }\nRendering 32cf6e950e024d3895ab5667409c2b8f with key doesn't exist in htmlMap {\n  key: '00000000000000000000000000000000|CacheClearingBehavior=Clear+on+publish&Theme=%7b67B98C36-84B8-413C-B729-99D9ED02834C%7d'\n}\nRendering bc6bf8d4cd4b4d4aa42aaebb6424117e with key doesn't exist in htmlMap {\n  key: '00000000000000000000000000000000|Mobile+Display=%7b6E50D5E2-04CC-41D2-8A38-F10E89AC4465%7d'\n}\nRendering 017081666d6a464197942675bd69c6d5 with key doesn't exist in htmlMap { key: '00000000000000000000000000000000|' }\nRendering bc6bf8d4cd4b4d4aa42aaebb6424117e with key doesn't exist in htmlMap {\n  key: '00000000000000000000000000000000|Mobile+Display=%7b6E50D5E2-04CC-41D2-8A38-F10E89AC4465%7d'\n}\nRendering 017081666d6a464197942675bd69c6d5 with key doesn't exist in htmlMap { key: '00000000000000000000000000000000|' }\nRendering bc6bf8d4cd4b4d4aa42aaebb6424117e with key doesn't exist in htmlMap {\n  key: '00000000000000000000000000000000|Mobile+Display=%7b6E50D5E2-04CC-41D2-8A38-F10E89AC4465%7d'\n}\nRendering 017081666d6a464197942675bd69c6d5 with key doesn't exist in htmlMap { key: '00000000000000000000000000000000|' }\nRendering 5ad6dae8d1774075ae07c8f15b03b8ff with key doesn't exist in htmlMap { key: '00000000000000000000000000000000|' }\nRendering 5ad6dae8d1774075ae07c8f15b03b8ff with key doesn't exist in htmlMap { key: '00000000000000000000000000000000|' }\ninfo  - Generating static pages (34/46)\nRendering 253f182346a04a338111c13f5253bcb8 with key doesn't exist in htmlMap {\n  key: '00000000000000000000000000000000|CacheClearingBehavior=Clear+on+publish&Theme=%7bB927812A-783D-4F2A-A689-1192CDA11AE1%7d'\n}\nRendering a7e314ab4f67408abbb2144c01b78c15 with key doesn't exist in htmlMap {\n  key: '00000000000000000000000000000000|CacheClearingBehavior=Clear+on+publish&Theme=%7b67B98C36-84B8-413C-B729-99D9ED02834C%7d'\n}\nRendering 253f182346a04a338111c13f5253bcb8 with key doesn't exist in htmlMap {\n  key: '00000000000000000000000000000000|CacheClearingBehavior=Clear+on+publish&Theme=%7bB927812A-783D-4F2A-A689-1192CDA11AE1%7d'\n}\nRendering 253f182346a04a338111c13f5253bcb8 with key doesn't exist in htmlMap {\n  key: '00000000000000000000000000000000|CacheClearingBehavior=Clear+on+publish&Theme=%7bB927812A-783D-4F2A-A689-1192CDA11AE1%7d'\n}\nRendering 5ad6dae8d1774075ae07c8f15b03b8ff with key doesn't exist in htmlMap { key: '00000000000000000000000000000000|' }\nRendering 017081666d6a464197942675bd69c6d5 with key doesn't exist in htmlMap { key: '00000000000000000000000000000000|' }\nRendering 0ef89a326baa4d1a88ee113b2f57c544 with key doesn't exist in htmlMap {\n  key: '00000000000000000000000000000000|CacheClearingBehavior=Clear+on+publish&Theme=%7b67B98C36-84B8-413C-B729-99D9ED02834C%7d'\n}\nRendering b59667186c8c47d98ec9fa31d9312253 with key doesn't exist in htmlMap {\n  key: '00000000000000000000000000000000|CacheClearingBehavior=Clear+on+publish&Theme=%7b67B98C36-84B8-413C-B729-99D9ED02834C%7d'\n}\nRendering b04b35029f7c4a7b9833f68cabb42208 with key doesn't exist in htmlMap {\n  key: '00000000000000000000000000000000|CacheClearingBehavior=Clear+on+publish&Theme=%7b67B98C36-84B8-413C-B729-99D9ED02834C%7d'\n}\nRendering 296e34e998a44235842f0d20f4b44980 with key doesn't exist in htmlMap {\n  key: '00000000000000000000000000000000|Alignment=%7b70E1224E-B3A0-4917-8473-6728A5DEF693%7d&CacheClearingBehavior=Clear+on+publish&Theme=%7b67B98C36-84B8-413C-B729-99D9ED02834C%7d'\n}\nRendering 017081666d6a464197942675bd69c6d5 with key doesn't exist in htmlMap { key: '00000000000000000000000000000000|' }\ninfo  - Generating static pages (46/46)\n",
  "stderr": "Browserslist: caniuse-lite is outdated. Please run:\n  npx browserslist@latest --update-db\n  Why you should do it regularly: https://github.com/browserslist/browserslist#browsers-data-updating\nerror - ESLint must be installed in order to run during builds: npm install --save-dev eslint\nBrowserslist: caniuse-lite is outdated. Please run:\n  npx browserslist@latest --update-db\n  Why you should do it regularly: https://github.com/browserslist/browserslist#browsers-data-updating\n(node:1087) [DEP0148] DeprecationWarning: Use of deprecated folder mapping \"./src/\" in the \"exports\" field module resolution of the package at /home/site/wwwroot/node_modules/ramda/package.json.\nUpdate this package.json to use a subpath pattern like \"./src/*\".\n(Use `node --trace-deprecation ...` to show where the warning was created)\nChanged javascript:void to # on node a\nChanged javascript:void to # on node a\nChanged javascript:void to # on node a\nChanged javascript:void to # on node a\nChanged javascript:void to # on node a\n\nError occurred prerendering page \"/en/insights/t03-topic/t06report2\". Read more: https://nextjs.org/docs/messages/prerender-error\nError: No r.componentName and no html available for rendering, r: 58718a7f53b74e7ca394293e75123243, uid: 1273b59144bc43838989e5423e1a080a, ds: aa63dfa7ac264e34b302967c281118ff, 8a7f3d94-af94-4213-9c54-99b89e6fa008, 8a7f3d94af9442139c5499b89e6fa008, placeholderKey: /aon-report-landing\n    at throwException (/home/site/wwwroot/node_modules/@uniformdev/common/dist/cjs/util/throwException.js:13:11)\n    at CreateRendering (/home/site/wwwroot/.temp/.next/server/chunks/170.js:1207:33)\n    at d (/home/site/wwwroot/node_modules/react-dom/cjs/react-dom-server.node.production.min.js:33:498)\n    at bb (/home/site/wwwroot/node_modules/react-dom/cjs/react-dom-server.node.production.min.js:36:16)\n    at a.b.render (/home/site/wwwroot/node_modules/react-dom/cjs/react-dom-server.node.production.min.js:42:43)\n    at a.b.read (/home/site/wwwroot/node_modules/react-dom/cjs/react-dom-server.node.production.min.js:41:83)\n    at Object.exports.renderToString (/home/site/wwwroot/node_modules/react-dom/cjs/react-dom-server.node.production.min.js:52:138)\n    at Object.renderPage (/home/site/wwwroot/node_modules/next/dist/server/render.js:768:45)\n    at Object.defaultGetInitialProps (/home/site/wwwroot/node_modules/next/dist/server/render.js:375:51)\n    at Function.getInitialProps (/home/site/wwwroot/.temp/.next/server/chunks/859.js:537:20)\nChanged javascript:void to # on node a\nChanged javascript:void to # on node a\nChanged javascript:void to # on node a\nChanged javascript:void to # on node a\nChanged javascript:void to # on node a\nChanged javascript:void to # on node a\nChanged javascript:void to # on node a\nChanged javascript:void to # on node a\nChanged javascript:void to # on node a\nChanged javascript:void to # on node a\nChanged javascript:void to # on node a\nChanged javascript:void to # on node a\nChanged javascript:void to # on node a\nChanged javascript:void to # on node a\nChanged javascript:void to # on node a\nChanged javascript:void to # on node a\nChanged javascript:void to # on node a\nChanged javascript:void to # on node a\nChanged javascript:void to # on node a\nChanged javascript:void to # on node a\nChanged javascript:void to # on node a\nChanged javascript:void to # on node a\nChanged javascript:void to # on node a\n\n> Build error occurred\nError: Export encountered errors on following paths:\n\t/[[...slug]]: /en/insights/t03-topic/t06report2\n    at /home/site/wwwroot/node_modules/next/dist/export/index.js:397:19\n    at runMicrotasks (<anonymous>)\n    at processTicksAndRejections (node:internal/process/task_queues:96:5)\n    at async Span.traceAsyncFn (/home/site/wwwroot/node_modules/next/dist/trace/trace.js:79:20)\n    at async /home/site/wwwroot/node_modules/next/dist/build/index.js:999:17\n    at async Span.traceAsyncFn (/home/site/wwwroot/node_modules/next/dist/trace/trace.js:79:20)\n    at async /home/site/wwwroot/node_modules/next/dist/build/index.js:875:13\n    at async Span.traceAsyncFn (/home/site/wwwroot/node_modules/next/dist/trace/trace.js:79:20)\n    at async Object.build [as default] (/home/site/wwwroot/node_modules/next/dist/build/index.js:55:25)\n",
  "name": "Error",
  "message": "Command failed: node ./scripts/generate-sitemap.js && node node_modules/next/dist/bin/next build && node node_modules/next/dist/bin/next export --outdir \"/home/site/wwwroot/.temp/195/out\"\nBrowserslist: caniuse-lite is outdated. Please run:\n  npx browserslist@latest --update-db\n  Why you should do it regularly: https://github.com/browserslist/browserslist#browsers-data-updating\nerror - ESLint must be installed in order to run during builds: npm install --save-dev eslint\nBrowserslist: caniuse-lite is outdated. Please run:\n  npx browserslist@latest --update-db\n  Why you should do it regularly: https://github.com/browserslist/browserslist#browsers-data-updating\n(node:1087) [DEP0148] DeprecationWarning: Use of deprecated folder mapping \"./src/\" in the \"exports\" field module resolution of the package at /home/site/wwwroot/node_modules/ramda/package.json.\nUpdate this package.json to use a subpath pattern like \"./src/*\".\n(Use `node --trace-deprecation ...` to show where the warning was created)\nChanged javascript:void to # on node a\nChanged javascript:void to # on node a\nChanged javascript:void to # on node a\nChanged javascript:void to # on node a\nChanged javascript:void to # on node a\n\nError occurred prerendering page \"/en/insights/t03-topic/t06report2\". Read more: https://nextjs.org/docs/messages/prerender-error\nError: No r.componentName and no html available for rendering, r: 58718a7f53b74e7ca394293e75123243, uid: 1273b59144bc43838989e5423e1a080a, ds: aa63dfa7ac264e34b302967c281118ff, 8a7f3d94-af94-4213-9c54-99b89e6fa008, 8a7f3d94af9442139c5499b89e6fa008, placeholderKey: /aon-report-landing\n    at throwException (/home/site/wwwroot/node_modules/@uniformdev/common/dist/cjs/util/throwException.js:13:11)\n    at CreateRendering (/home/site/wwwroot/.temp/.next/server/chunks/170.js:1207:33)\n    at d (/home/site/wwwroot/node_modules/react-dom/cjs/react-dom-server.node.production.min.js:33:498)\n    at bb (/home/site/wwwroot/node_modules/react-dom/cjs/react-dom-server.node.production.min.js:36:16)\n    at a.b.render (/home/site/wwwroot/node_modules/react-dom/cjs/react-dom-server.node.production.min.js:42:43)\n    at a.b.read (/home/site/wwwroot/node_modules/react-dom/cjs/react-dom-server.node.production.min.js:41:83)\n    at Object.exports.renderToString (/home/site/wwwroot/node_modules/react-dom/cjs/react-dom-server.node.production.min.js:52:138)\n    at Object.renderPage (/home/site/wwwroot/node_modules/next/dist/server/render.js:768:45)\n    at Object.defaultGetInitialProps (/home/site/wwwroot/node_modules/next/dist/server/render.js:375:51)\n    at Function.getInitialProps (/home/site/wwwroot/.temp/.next/server/chunks/859.js:537:20)\nChanged javascript:void to # on node a\nChanged javascript:void to # on node a\nChanged javascript:void to # on node a\nChanged javascript:void to # on node a\nChanged javascript:void to # on node a\nChanged javascript:void to # on node a\nChanged javascript:void to # on node a\nChanged javascript:void to # on node a\nChanged javascript:void to # on node a\nChanged javascript:void to # on node a\nChanged javascript:void to # on node a\nChanged javascript:void to # on node a\nChanged javascript:void to # on node a\nChanged javascript:void to # on node a\nChanged javascript:void to # on node a\nChanged javascript:void to # on node a\nChanged javascript:void to # on node a\nChanged javascript:void to # on node a\nChanged javascript:void to # on node a\nChanged javascript:void to # on node a\nChanged javascript:void to # on node a\nChanged javascript:void to # on node a\nChanged javascript:void to # on node a\n\n> Build error occurred\nError: Export encountered errors on following paths:\n\t/[[...slug]]: /en/insights/t03-topic/t06report2\n    at /home/site/wwwroot/node_modules/next/dist/export/index.js:397:19\n    at runMicrotasks (<anonymous>)\n    at processTicksAndRejections (node:internal/process/task_queues:96:5)\n    at async Span.traceAsyncFn (/home/site/wwwroot/node_modules/next/dist/trace/trace.js:79:20)\n    at async /home/site/wwwroot/node_modules/next/dist/build/index.js:999:17\n    at async Span.traceAsyncFn (/home/site/wwwroot/node_modules/next/dist/trace/trace.js:79:20)\n    at async /home/site/wwwroot/node_modules/next/dist/build/index.js:875:13\n    at async Span.traceAsyncFn (/home/site/wwwroot/node_modules/next/dist/trace/trace.js:79:20)\n    at async Object.build [as default] (/home/site/wwwroot/node_modules/next/dist/build/index.js:55:25)\n",
  "stack": "Error: Command failed: node ./scripts/generate-sitemap.js && node node_modules/next/dist/bin/next build && node node_modules/next/dist/bin/next export --outdir \"/home/site/wwwroot/.temp/195/out\"\nBrowserslist: caniuse-lite is outdated. Please run:\n  npx browserslist@latest --update-db\n  Why you should do it regularly: https://github.com/browserslist/browserslist#browsers-data-updating\nerror - ESLint must be installed in order to run during builds: npm install --save-dev eslint\nBrowserslist: caniuse-lite is outdated. Please run:\n  npx browserslist@latest --update-db\n  Why you should do it regularly: https://github.com/browserslist/browserslist#browsers-data-updating\n(node:1087) [DEP0148] DeprecationWarning: Use of deprecated folder mapping \"./src/\" in the \"exports\" field module resolution of the package at /home/site/wwwroot/node_modules/ramda/package.json.\nUpdate this package.json to use a subpath pattern like \"./src/*\".\n(Use `node --trace-deprecation ...` to show where the warning was created)\nChanged javascript:void to # on node a\nChanged javascript:void to # on node a\nChanged javascript:void to # on node a\nChanged javascript:void to # on node a\nChanged javascript:void to # on node a\n\nError occurred prerendering page \"/en/insights/t03-topic/t06report2\". Read more: https://nextjs.org/docs/messages/prerender-error\nError: No r.componentName and no html available for rendering, r: 58718a7f53b74e7ca394293e75123243, uid: 1273b59144bc43838989e5423e1a080a, ds: aa63dfa7ac264e34b302967c281118ff, 8a7f3d94-af94-4213-9c54-99b89e6fa008, 8a7f3d94af9442139c5499b89e6fa008, placeholderKey: /aon-report-landing\n    at throwException (/home/site/wwwroot/node_modules/@uniformdev/common/dist/cjs/util/throwException.js:13:11)\n    at CreateRendering (/home/site/wwwroot/.temp/.next/server/chunks/170.js:1207:33)\n    at d (/home/site/wwwroot/node_modules/react-dom/cjs/react-dom-server.node.production.min.js:33:498)\n    at bb (/home/site/wwwroot/node_modules/react-dom/cjs/react-dom-server.node.production.min.js:36:16)\n    at a.b.render (/home/site/wwwroot/node_modules/react-dom/cjs/react-dom-server.node.production.min.js:42:43)\n    at a.b.read (/home/site/wwwroot/node_modules/react-dom/cjs/react-dom-server.node.production.min.js:41:83)\n    at Object.exports.renderToString (/home/site/wwwroot/node_modules/react-dom/cjs/react-dom-server.node.production.min.js:52:138)\n    at Object.renderPage (/home/site/wwwroot/node_modules/next/dist/server/render.js:768:45)\n    at Object.defaultGetInitialProps (/home/site/wwwroot/node_modules/next/dist/server/render.js:375:51)\n    at Function.getInitialProps (/home/site/wwwroot/.temp/.next/server/chunks/859.js:537:20)\nChanged javascript:void to # on node a\nChanged javascript:void to # on node a\nChanged javascript:void to # on node a\nChanged javascript:void to # on node a\nChanged javascript:void to # on node a\nChanged javascript:void to # on node a\nChanged javascript:void to # on node a\nChanged javascript:void to # on node a\nChanged javascript:void to # on node a\nChanged javascript:void to # on node a\nChanged javascript:void to # on node a\nChanged javascript:void to # on node a\nChanged javascript:void to # on node a\nChanged javascript:void to # on node a\nChanged javascript:void to # on node a\nChanged javascript:void to # on node a\nChanged javascript:void to # on node a\nChanged javascript:void to # on node a\nChanged javascript:void to # on node a\nChanged javascript:void to # on node a\nChanged javascript:void to # on node a\nChanged javascript:void to # on node a\nChanged javascript:void to # on node a\n\n> Build error occurred\nError: Export encountered errors on following paths:\n\t/[[...slug]]: /en/insights/t03-topic/t06report2\n    at /home/site/wwwroot/node_modules/next/dist/export/index.js:397:19\n    at runMicrotasks (<anonymous>)\n    at processTicksAndRejections (node:internal/process/task_queues:96:5)\n    at async Span.traceAsyncFn (/home/site/wwwroot/node_modules/next/dist/trace/trace.js:79:20)\n    at async /home/site/wwwroot/node_modules/next/dist/build/index.js:999:17\n    at async Span.traceAsyncFn (/home/site/wwwroot/node_modules/next/dist/trace/trace.js:79:20)\n    at async /home/site/wwwroot/node_modules/next/dist/build/index.js:875:13\n    at async Span.traceAsyncFn (/home/site/wwwroot/node_modules/next/dist/trace/trace.js:79:20)\n    at async Object.build [as default] (/home/site/wwwroot/node_modules/next/dist/build/index.js:55:25)\n\n    at ChildProcess.exithandler (node:child_process:402:12)\n    at ChildProcess.emit (node:events:513:28)\n    at ChildProcess.emit (node:domain:489:12)\n    at maybeClose (node:internal/child_process:1100:16)\n    at Process.ChildProcess._handle.onexit (node:internal/child_process:304:5)"
}, output: {"status":"Failed","message":"Failed to build and export site","error":{"code":1,"killed":false,"signal":null,"cmd":"node ./scripts/generate-sitemap.js && node node_modules/next/dist/bin/next build && node node_modules/next/dist/bin/next export --outdir \"/home/site/wwwroot/.temp/195/out\"","stdout":"06/04-07:48:11  \u001b[32minfo\u001b[39m: \u001b[32mUniform version: 7.0.220726-1\u001b[39m \n06/04-07:48:11  \u001b[32minfo\u001b[39m: \u001b[32mLoading Uniform config...\u001b[39m \n06/04-07:48:11  \u001b[32minfo\u001b[39m: \u001b[32mpublicRuntimeConfig: {\"UNIFORM_API_URL\":\"https://aonqaxpscaledcntcache.z20.web.core.windows.net\",\"UNIFORM_API_SITENAME\":\"aon\",\"UNIFORM_CONTENT_URL\":\"https://aonqaxpscaledcntcache.z20.web.core.windows.net\",\"UNIFORM_API_MAPSERVICE\":\"/uniform/api/content/${UNIFORM_API_SITENAME}/map\",\"UNIFORM_OPTIONS_PREVIEW\":false,\"UNIFORM_OPTIONS_DEBUG\":false,\"UNIFORM_OPTIONS_PREFETCH_LINKS\":false,\"UNIFORM_OPTIONS_ESI\":true}\u001b[39m \ninfo  - Checking validity of types...\ninfo  - Creating an optimized production build...\ninfo  - Compiled successfully\ninfo  - Collecting page data...\n06/04-07:48:29  \u001b[32minfo\u001b[39m: \u001b[32mParsing .publish-map.json...\u001b[39m \ninfo  - Generating static pages (0/46)\nRendering 1ee6a310e0fe430ea17ac2032ccf5f52 with key doesn't exist in htmlMap {\n  key: '00000000000000000000000000000000|Alignment=%7b24CCA138-3C11-46BE-9951-670AA2855648%7d&CacheClearingBehavior=Clear+on+publish&Id=webinar&Theme=%7b47A0F1D1-2E1A-48D8-8201-C6B8AA3CF202%7d'\n}\nRendering 3f139e6f6706493f810132ba23fa9236 with key doesn't exist in htmlMap { key: '00000000000000000000000000000000|' }\nRendering 3f139e6f6706493f810132ba23fa9236 with key doesn't exist in htmlMap { key: '00000000000000000000000000000000|' }\nRendering 3f139e6f6706493f810132ba23fa9236 with key doesn't exist in htmlMap { key: '00000000000000000000000000000000|' }\ninfo  - Generating static pages (11/46)\nRendering 3f139e6f6706493f810132ba23fa9236 with key doesn't exist in htmlMap { key: '00000000000000000000000000000000|' }\nRendering 14c2534c6d4948c58146a1ed9ca5fbbd with key doesn't exist in htmlMap {\n  key: '00000000000000000000000000000000|CacheClearingBehavior=Clear+on+publish&Theme=%7b7A398181-0A25-4AFB-9893-FC895805B6F6%7d'\n}\nRendering 6b896ab20c25488aaaf603fbfdc7f8eb with key doesn't exist in htmlMap {\n  key: '00000000000000000000000000000000|CacheClearingBehavior=Clear+on+publish'\n}\nRendering bc6bf8d4cd4b4d4aa42aaebb6424117e with key doesn't exist in htmlMap {\n  key: '00000000000000000000000000000000|Mobile+Display=%7b6E50D5E2-04CC-41D2-8A38-F10E89AC4465%7d'\n}\nRendering aa28cebbf32d4431a89d025110ed617b with key doesn't exist in htmlMap { key: '00000000000000000000000000000000|' }\nRendering 1ee6a310e0fe430ea17ac2032ccf5f52 with key doesn't exist in htmlMap {\n  key: '00000000000000000000000000000000|Alignment=%7b24CCA138-3C11-46BE-9951-670AA2855648%7d&Theme=%7b67B98C36-84B8-413C-B729-99D9ED02834C%7d'\n}\nRendering 197fdf0210c146e4a980d2a61756e852 with key doesn't exist in htmlMap { key: '00000000000000000000000000000000|' }\nRendering 63ccc1b5346c4a64b3519281e5d90f6c with key doesn't exist in htmlMap {\n  key: '00000000000000000000000000000000|CacheClearingBehavior=Clear+on+publish'\n}\nRendering bc6bf8d4cd4b4d4aa42aaebb6424117e with key doesn't exist in htmlMap {\n  key: '00000000000000000000000000000000|Mobile+Display=%7b6E50D5E2-04CC-41D2-8A38-F10E89AC4465%7d'\n}\nRendering 013223a73c444f9a8fc16ec30364b830 with key doesn't exist in htmlMap { key: '00000000000000000000000000000000|' }\nRendering 258e2985e4a846da9f3adf79711c4699 with key doesn't exist in htmlMap { key: '00000000000000000000000000000000|' }\nRendering 37151af2fcda4ff18729576ec093c1cb with key doesn't exist in htmlMap { key: '00000000000000000000000000000000|' }\nRendering 32cf6e950e024d3895ab5667409c2b8f with key doesn't exist in htmlMap { key: '00000000000000000000000000000000|' }\nRendering 14c2534c6d4948c58146a1ed9ca5fbbd with key doesn't exist in htmlMap {\n  key: '00000000000000000000000000000000|CacheClearingBehavior=Clear+on+publish&Theme=%7b7A398181-0A25-4AFB-9893-FC895805B6F6%7d'\n}\nRendering 6b896ab20c25488aaaf603fbfdc7f8eb with key doesn't exist in htmlMap {\n  key: '00000000000000000000000000000000|CacheClearingBehavior=Clear+on+publish'\n}\nRendering bc6bf8d4cd4b4d4aa42aaebb6424117e with key doesn't exist in htmlMap {\n  key: '00000000000000000000000000000000|Mobile+Display=%7b6E50D5E2-04CC-41D2-8A38-F10E89AC4465%7d'\n}\nRendering bc6bf8d4cd4b4d4aa42aaebb6424117e with key doesn't exist in htmlMap {\n  key: '00000000000000000000000000000000|Mobile+Display=%7b6E50D5E2-04CC-41D2-8A38-F10E89AC4465%7d'\n}\nRendering 63ccc1b5346c4a64b3519281e5d90f6c with key doesn't exist in htmlMap {\n  key: '00000000000000000000000000000000|CacheClearingBehavior=Clear+on+publish'\n}\nRendering 197fdf0210c146e4a980d2a61756e852 with key doesn't exist in htmlMap {\n  key: '00000000000000000000000000000000|CacheClearingBehavior=Clear+on+publish&Theme=%7b67B98C36-84B8-413C-B729-99D9ED02834C%7d'\n}\nRendering 6b896ab20c25488aaaf603fbfdc7f8eb with key doesn't exist in htmlMap { key: '00000000000000000000000000000000|' }\nRendering bc6bf8d4cd4b4d4aa42aaebb6424117e with key doesn't exist in htmlMap {\n  key: '00000000000000000000000000000000|Mobile+Display=%7b6E50D5E2-04CC-41D2-8A38-F10E89AC4465%7d'\n}\nRendering 013223a73c444f9a8fc16ec30364b830 with key doesn't exist in htmlMap { key: '00000000000000000000000000000000|' }\nRendering 37151af2fcda4ff18729576ec093c1cb with key doesn't exist in htmlMap { key: '00000000000000000000000000000000|' }\nRendering 32cf6e950e024d3895ab5667409c2b8f with key doesn't exist in htmlMap {\n  key: '00000000000000000000000000000000|CacheClearingBehavior=Clear+on+publish&Theme=%7bB07799B5-E238-4B34-9619-1E1A23147B0F%7d'\n}\nRendering bc6bf8d4cd4b4d4aa42aaebb6424117e with key doesn't exist in htmlMap {\n  key: '00000000000000000000000000000000|Mobile+Display=%7b6E50D5E2-04CC-41D2-8A38-F10E89AC4465%7d'\n}\nRendering bc6bf8d4cd4b4d4aa42aaebb6424117e with key doesn't exist in htmlMap {\n  key: '00000000000000000000000000000000|Mobile+Display=%7b6E50D5E2-04CC-41D2-8A38-F10E89AC4465%7d'\n}\nRendering 14c2534c6d4948c58146a1ed9ca5fbbd with key doesn't exist in htmlMap {\n  key: '00000000000000000000000000000000|CacheClearingBehavior=Clear+on+publish&Theme=%7b7A398181-0A25-4AFB-9893-FC895805B6F6%7d'\n}\nRendering 6b896ab20c25488aaaf603fbfdc7f8eb with key doesn't exist in htmlMap {\n  key: '00000000000000000000000000000000|CacheClearingBehavior=Clear+on+publish'\n}\nRendering bc6bf8d4cd4b4d4aa42aaebb6424117e with key doesn't exist in htmlMap {\n  key: '00000000000000000000000000000000|Mobile+Display=%7b6E50D5E2-04CC-41D2-8A38-F10E89AC4465%7d'\n}\nRendering bc6bf8d4cd4b4d4aa42aaebb6424117e with key doesn't exist in htmlMap {\n  key: '00000000000000000000000000000000|Mobile+Display=%7b6E50D5E2-04CC-41D2-8A38-F10E89AC4465%7d'\n}\nRendering 197fdf0210c146e4a980d2a61756e852 with key doesn't exist in htmlMap {\n  key: '00000000000000000000000000000000|CacheClearingBehavior=Clear+on+publish&Theme=%7b67B98C36-84B8-413C-B729-99D9ED02834C%7d'\n}\nRendering 6b896ab20c25488aaaf603fbfdc7f8eb with key doesn't exist in htmlMap { key: '00000000000000000000000000000000|' }\nRendering 63ccc1b5346c4a64b3519281e5d90f6c with key doesn't exist in htmlMap { key: '00000000000000000000000000000000|' }\nRendering 37151af2fcda4ff18729576ec093c1cb with key doesn't exist in htmlMap { key: '00000000000000000000000000000000|' }\nRendering 6b896ab20c25488aaaf603fbfdc7f8eb with key doesn't exist in htmlMap { key: '00000000000000000000000000000000|' }\nRendering bc6bf8d4cd4b4d4aa42aaebb6424117e with key doesn't exist in htmlMap {\n  key: '00000000000000000000000000000000|Mobile+Display=%7b6E50D5E2-04CC-41D2-8A38-F10E89AC4465%7d'\n}\nRendering bc6bf8d4cd4b4d4aa42aaebb6424117e with key doesn't exist in htmlMap {\n  key: '00000000000000000000000000000000|Mobile+Display=%7b6E50D5E2-04CC-41D2-8A38-F10E89AC4465%7d'\n}\nRendering 32cf6e950e024d3895ab5667409c2b8f with key doesn't exist in htmlMap { key: '00000000000000000000000000000000|' }\nRendering bc6bf8d4cd4b4d4aa42aaebb6424117e with key doesn't exist in htmlMap {\n  key: '00000000000000000000000000000000|Mobile+Display=%7b6E50D5E2-04CC-41D2-8A38-F10E89AC4465%7d'\n}\nRendering bc6bf8d4cd4b4d4aa42aaebb6424117e with key doesn't exist in htmlMap {\n  key: '00000000000000000000000000000000|Mobile+Display=%7b6E50D5E2-04CC-41D2-8A38-F10E89AC4465%7d'\n}\ninfo  - Generating static pages (22/46)\nRendering bc6bf8d4cd4b4d4aa42aaebb6424117e with key doesn't exist in htmlMap {\n  key: '00000000000000000000000000000000|Mobile+Display=%7b6E50D5E2-04CC-41D2-8A38-F10E89AC4465%7d'\n}\nRendering 017081666d6a464197942675bd69c6d5 with key doesn't exist in htmlMap { key: '00000000000000000000000000000000|' }\nRendering a7e314ab4f67408abbb2144c01b78c15 with key doesn't exist in htmlMap {\n  key: '00000000000000000000000000000000|CacheClearingBehavior=Clear+on+publish&Theme=%7b67B98C36-84B8-413C-B729-99D9ED02834C%7d'\n}\nRendering 58718a7f53b74e7ca394293e75123243 with key doesn't exist in htmlMap {\n  key: 'aa63dfa7ac264e34b302967c281118ff|CacheClearingBehavior=Clear+on+publish&Id=stat-block&Layout=%7b313AF655-FA87-4E3D-B800-F4B763F417AB%7d&Theme=%7b67B98C36-84B8-413C-B729-99D9ED02834C%7d'\n}\nRendering bc6bf8d4cd4b4d4aa42aaebb6424117e with key doesn't exist in htmlMap {\n  key: '00000000000000000000000000000000|Mobile+Display=%7b6E50D5E2-04CC-41D2-8A38-F10E89AC4465%7d'\n}\nRendering 017081666d6a464197942675bd69c6d5 with key doesn't exist in htmlMap { key: '00000000000000000000000000000000|' }\nRendering 32cf6e950e024d3895ab5667409c2b8f with key doesn't exist in htmlMap {\n  key: '00000000000000000000000000000000|CacheClearingBehavior=Clear+on+publish&Theme=%7b67B98C36-84B8-413C-B729-99D9ED02834C%7d'\n}\nRendering bc6bf8d4cd4b4d4aa42aaebb6424117e with key doesn't exist in htmlMap {\n  key: '00000000000000000000000000000000|Mobile+Display=%7b6E50D5E2-04CC-41D2-8A38-F10E89AC4465%7d'\n}\nRendering 017081666d6a464197942675bd69c6d5 with key doesn't exist in htmlMap { key: '00000000000000000000000000000000|' }\nRendering bc6bf8d4cd4b4d4aa42aaebb6424117e with key doesn't exist in htmlMap {\n  key: '00000000000000000000000000000000|Mobile+Display=%7b6E50D5E2-04CC-41D2-8A38-F10E89AC4465%7d'\n}\nRendering 017081666d6a464197942675bd69c6d5 with key doesn't exist in htmlMap { key: '00000000000000000000000000000000|' }\nRendering bc6bf8d4cd4b4d4aa42aaebb6424117e with key doesn't exist in htmlMap {\n  key: '00000000000000000000000000000000|Mobile+Display=%7b6E50D5E2-04CC-41D2-8A38-F10E89AC4465%7d'\n}\nRendering 017081666d6a464197942675bd69c6d5 with key doesn't exist in htmlMap { key: '00000000000000000000000000000000|' }\nRendering 5ad6dae8d1774075ae07c8f15b03b8ff with key doesn't exist in htmlMap { key: '00000000000000000000000000000000|' }\nRendering 5ad6dae8d1774075ae07c8f15b03b8ff with key doesn't exist in htmlMap { key: '00000000000000000000000000000000|' }\ninfo  - Generating static pages (34/46)\nRendering 253f182346a04a338111c13f5253bcb8 with key doesn't exist in htmlMap {\n  key: '00000000000000000000000000000000|CacheClearingBehavior=Clear+on+publish&Theme=%7bB927812A-783D-4F2A-A689-1192CDA11AE1%7d'\n}\nRendering a7e314ab4f67408abbb2144c01b78c15 with key doesn't exist in htmlMap {\n  key: '00000000000000000000000000000000|CacheClearingBehavior=Clear+on+publish&Theme=%7b67B98C36-84B8-413C-B729-99D9ED02834C%7d'\n}\nRendering 253f182346a04a338111c13f5253bcb8 with key doesn't exist in htmlMap {\n  key: '00000000000000000000000000000000|CacheClearingBehavior=Clear+on+publish&Theme=%7bB927812A-783D-4F2A-A689-1192CDA11AE1%7d'\n}\nRendering 253f182346a04a338111c13f5253bcb8 with key doesn't exist in htmlMap {\n  key: '00000000000000000000000000000000|CacheClearingBehavior=Clear+on+publish&Theme=%7bB927812A-783D-4F2A-A689-1192CDA11AE1%7d'\n}\nRendering 5ad6dae8d1774075ae07c8f15b03b8ff with key doesn't exist in htmlMap { key: '00000000000000000000000000000000|' }\nRendering 017081666d6a464197942675bd69c6d5 with key doesn't exist in htmlMap { key: '00000000000000000000000000000000|' }\nRendering 0ef89a326baa4d1a88ee113b2f57c544 with key doesn't exist in htmlMap {\n  key: '00000000000000000000000000000000|CacheClearingBehavior=Clear+on+publish&Theme=%7b67B98C36-84B8-413C-B729-99D9ED02834C%7d'\n}\nRendering b59667186c8c47d98ec9fa31d9312253 with key doesn't exist in htmlMap {\n  key: '00000000000000000000000000000000|CacheClearingBehavior=Clear+on+publish&Theme=%7b67B98C36-84B8-413C-B729-99D9ED02834C%7d'\n}\nRendering b04b35029f7c4a7b9833f68cabb42208 with key doesn't exist in htmlMap {\n  key: '00000000000000000000000000000000|CacheClearingBehavior=Clear+on+publish&Theme=%7b67B98C36-84B8-413C-B729-99D9ED02834C%7d'\n}\nRendering 296e34e998a44235842f0d20f4b44980 with key doesn't exist in htmlMap {\n  key: '00000000000000000000000000000000|Alignment=%7b70E1224E-B3A0-4917-8473-6728A5DEF693%7d&CacheClearingBehavior=Clear+on+publish&Theme=%7b67B98C36-84B8-413C-B729-99D9ED02834C%7d'\n}\nRendering 017081666d6a464197942675bd69c6d5 with key doesn't exist in htmlMap { key: '00000000000000000000000000000000|' }\ninfo  - Generating static pages (46/46)\n","stderr":"Browserslist: caniuse-lite is outdated. Please run:\n  npx browserslist@latest --update-db\n  Why you should do it regularly: https://github.com/browserslist/browserslist#browsers-data-updating\nerror - ESLint must be installed in order to run during builds: npm install --save-dev eslint\nBrowserslist: caniuse-lite is outdated. Please run:\n  npx browserslist@latest --update-db\n  Why you should do it regularly: https://github.com/browserslist/browserslist#browsers-data-updating\n(node:1087) [DEP0148] DeprecationWarning: Use of deprecated folder mapping \"./src/\" in the \"exports\" field module resolution of the package at /home/site/wwwroot/node_modules/ramda/package.json.\nUpdate this package.json to use a subpath pattern like \"./src/*\".\n(Use `node --trace-deprecation ...` to show where the warning was created)\nChanged javascript:void to # on node a\nChanged javascript:void to # on node a\nChanged javascript:void to # on node a\nChanged javascript:void to # on node a\nChanged javascript:void to # on node a\n\nError occurred prerendering page \"/en/insights/t03-topic/t06report2\". Read more: https://nextjs.org/docs/messages/prerender-error\nError: No r.componentName and no html available for rendering, r: 58718a7f53b74e7ca394293e75123243, uid: 1273b59144bc43838989e5423e1a080a, ds: aa63dfa7ac264e34b302967c281118ff, 8a7f3d94-af94-4213-9c54-99b89e6fa008, 8a7f3d94af9442139c5499b89e6fa008, placeholderKey: /aon-report-landing\n    at throwException (/home/site/wwwroot/node_modules/@uniformdev/common/dist/cjs/util/throwException.js:13:11)\n    at CreateRendering (/home/site/wwwroot/.temp/.next/server/chunks/170.js:1207:33)\n    at d (/home/site/wwwroot/node_modules/react-dom/cjs/react-dom-server.node.production.min.js:33:498)\n    at bb (/home/site/wwwroot/node_modules/react-dom/cjs/react-dom-server.node.production.min.js:36:16)\n    at a.b.render (/home/site/wwwroot/node_modules/react-dom/cjs/react-dom-server.node.production.min.js:42:43)\n    at a.b.read (/home/site/wwwroot/node_modules/react-dom/cjs/react-dom-server.node.production.min.js:41:83)\n    at Object.exports.renderToString (/home/site/wwwroot/node_modules/react-dom/cjs/react-dom-server.node.production.min.js:52:138)\n    at Object.renderPage (/home/site/wwwroot/node_modules/next/dist/server/render.js:768:45)\n    at Object.defaultGetInitialProps (/home/site/wwwroot/node_modules/next/dist/server/render.js:375:51)\n    at Function.getInitialProps (/home/site/wwwroot/.temp/.next/server/chunks/859.js:537:20)\nChanged javascript:void to # on node a\nChanged javascript:void to # on node a\nChanged javascript:void to # on node a\nChanged javascript:void to # on node a\nChanged javascript:void to # on node a\nChanged javascript:void to # on node a\nChanged javascript:void to # on node a\nChanged javascript:void to # on node a\nChanged javascript:void to # on node a\nChanged javascript:void to # on node a\nChanged javascript:void to # on node a\nChanged javascript:void to # on node a\nChanged javascript:void to # on node a\nChanged javascript:void to # on node a\nChanged javascript:void to # on node a\nChanged javascript:void to # on node a\nChanged javascript:void to # on node a\nChanged javascript:void to # on node a\nChanged javascript:void to # on node a\nChanged javascript:void to # on node a\nChanged javascript:void to # on node a\nChanged javascript:void to # on node a\nChanged javascript:void to # on node a\n\n> Build error occurred\nError: Export encountered errors on following paths:\n\t/[[...slug]]: /en/insights/t03-topic/t06report2\n    at /home/site/wwwroot/node_modules/next/dist/export/index.js:397:19\n    at runMicrotasks (<anonymous>)\n    at processTicksAndRejections (node:internal/process/task_queues:96:5)\n    at async Span.traceAsyncFn (/home/site/wwwroot/node_modules/next/dist/trace/trace.js:79:20)\n    at async /home/site/wwwroot/node_modules/next/dist/build/index.js:999:17\n    at async Span.traceAsyncFn (/home/site/wwwroot/node_modules/next/dist/trace/trace.js:79:20)\n    at async /home/site/wwwroot/node_modules/next/dist/build/index.js:875:13\n    at async Span.traceAsyncFn (/home/site/wwwroot/node_modules/next/dist/trace/trace.js:79:20)\n    at async Object.build [as default] (/home/site/wwwroot/node_modules/next/dist/build/index.js:55:25)\n","name":"Error","message":"Command failed: node ./scripts/generate-sitemap.js && node node_modules/next/dist/bin/next build && node node_modules/next/dist/bin/next export --outdir \"/home/site/wwwroot/.temp/195/out\"\nBrowserslist: caniuse-lite is outdated. Please run:\n  npx browserslist@latest --update-db\n  Why you should do it regularly: https://github.com/browserslist/browserslist#browsers-data-updating\nerror - ESLint must be installed in order to run during builds: npm install --save-dev eslint\nBrowserslist: caniuse-lite is outdated. Please run:\n  npx browserslist@latest --update-db\n  Why you should do it regularly: https://github.com/browserslist/browserslist#browsers-data-updating\n(node:1087) [DEP0148] DeprecationWarning: Use of deprecated folder mapping \"./src/\" in the \"exports\" field module resolution of the package at /home/site/wwwroot/node_modules/ramda/package.json.\nUpdate this package.json to use a subpath pattern like \"./src/*\".\n(Use `node --trace-deprecation ...` to show where the warning was created)\nChanged javascript:void to # on node a\nChanged javascript:void to # on node a\nChanged javascript:void to # on node a\nChanged javascript:void to # on node a\nChanged javascript:void to # on node a\n\nError occurred prerendering page \"/en/insights/t03-topic/t06report2\". Read more: https://nextjs.org/docs/messages/prerender-error\nError: No r.componentName and no html available for rendering, r: 58718a7f53b74e7ca394293e75123243, uid: 1273b59144bc43838989e5423e1a080a, ds: aa63dfa7ac264e34b302967c281118ff, 8a7f3d94-af94-4213-9c54-99b89e6fa008, 8a7f3d94af9442139c5499b89e6fa008, placeholderKey: /aon-report-landing\n    at throwException (/home/site/wwwroot/node_modules/@uniformdev/common/dist/cjs/util/throwException.js:13:11)\n    at CreateRendering (/home/site/wwwroot/.temp/.next/server/chunks/170.js:1207:33)\n    at d (/home/site/wwwroot/node_modules/react-dom/cjs/react-dom-server.node.production.min.js:33:498)\n    at bb (/home/site/wwwroot/node_modules/react-dom/cjs/react-dom-server.node.production.min.js:36:16)\n    at a.b.render (/home/site/wwwroot/node_modules/react-dom/cjs/react-dom-server.node.production.min.js:42:43)\n    at a.b.read (/home/site/wwwroot/node_modules/react-dom/cjs/react-dom-server.node.production.min.js:41:83)\n    at Object.exports.renderToString (/home/site/wwwroot/node_modules/react-dom/cjs/react-dom-server.node.production.min.js:52:138)\n    at Object.renderPage (/home/site/wwwroot/node_modules/next/dist/server/render.js:768:45)\n    at Object.defaultGetInitialProps (/home/site/wwwroot/node_modules/next/dist/server/render.js:375:51)\n    at Function.getInitialProps (/home/site/wwwroot/.temp/.next/server/chunks/859.js:537:20)\nChanged javascript:void to # on node a\nChanged javascript:void to # on node a\nChanged javascript:void to # on node a\nChanged javascript:void to # on node a\nChanged javascript:void to # on node a\nChanged javascript:void to # on node a\nChanged javascript:void to # on node a\nChanged javascript:void to # on node a\nChanged javascript:void to # on node a\nChanged javascript:void to # on node a\nChanged javascript:void to # on node a\nChanged javascript:void to # on node a\nChanged javascript:void to # on node a\nChanged javascript:void to # on node a\nChanged javascript:void to # on node a\nChanged javascript:void to # on node a\nChanged javascript:void to # on node a\nChanged javascript:void to # on node a\nChanged javascript:void to # on node a\nChanged javascript:void to # on node a\nChanged javascript:void to # on node a\nChanged javascript:void to # on node a\nChanged javascript:void to # on node a\n\n> Build error occurred\nError: Export encountered errors on following paths:\n\t/[[...slug]]: /en/insights/t03-topic/t06report2\n    at /home/site/wwwroot/node_modules/next/dist/export/index.js:397:19\n    at runMicrotasks (<anonymous>)\n    at processTicksAndRejections (node:internal/process/task_queues:96:5)\n    at async Span.traceAsyncFn (/home/site/wwwroot/node_modules/next/dist/trace/trace.js:79:20)\n    at async /home/site/wwwroot/node_modules/next/dist/build/index.js:999:17\n    at async Span.traceAsyncFn (/home/site/wwwroot/node_modules/next/dist/trace/trace.js:79:20)\n    at async /home/site/wwwroot/node_modules/next/dist/build/index.js:875:13\n    at async Span.traceAsyncFn (/home/site/wwwroot/node_modules/next/dist/trace/trace.js:79:20)\n    at async Object.build [as default] (/home/site/wwwroot/node_modules/next/dist/build/index.js:55:25)\n","stack":"Error: Command failed: node ./scripts/generate-sitemap.js && node node_modules/next/dist/bin/next build && node node_modules/next/dist/bin/next export --outdir \"/home/site/wwwroot/.temp/195/out\"\nBrowserslist: caniuse-lite is outdated. Please run:\n  npx browserslist@latest --update-db\n  Why you should do it regularly: https://github.com/browserslist/browserslist#browsers-data-updating\nerror - ESLint must be installed in order to run during builds: npm install --save-dev eslint\nBrowserslist: caniuse-lite is outdated. Please run:\n  npx browserslist@latest --update-db\n  Why you should do it regularly: https://github.com/browserslist/browserslist#browsers-data-updating\n(node:1087) [DEP0148] DeprecationWarning: Use of deprecated folder mapping \"./src/\" in the \"exports\" field module resolution of the package at /home/site/wwwroot/node_modules/ramda/package.json.\nUpdate this package.json to use a subpath pattern like \"./src/*\".\n(Use `node --trace-deprecation ...` to show where the warning was created)\nChanged javascript:void to # on node a\nChanged javascript:void to # on node a\nChanged javascript:void to # on node a\nChanged javascript:void to # on node a\nChanged javascript:void to # on node a\n\nError occurred prerendering page \"/en/insights/t03-topic/t06report2\". Read more: https://nextjs.org/docs/messages/prerender-error\nError: No r.componentName and no html available for rendering, r: 58718a7f53b74e7ca394293e75123243, uid: 1273b59144bc43838989e5423e1a080a, ds: aa63dfa7ac264e34b302967c281118ff, 8a7f3d94-af94-4213-9c54-99b89e6fa008, 8a7f3d94af9442139c5499b89e6fa008, placeholderKey: /aon-report-landing\n    at throwException (/home/site/wwwroot/node_modules/@uniformdev/common/dist/cjs/util/throwException.js:13:11)\n    at CreateRendering (/home/site/wwwroot/.temp/.next/server/chunks/170.js:1207:33)\n    at d (/home/site/wwwroot/node_modules/react-dom/cjs/react-dom-server.node.production.min.js:33:498)\n    at bb (/home/site/wwwroot/node_modules/react-dom/cjs/react-dom-server.node.production.min.js:36:16)\n    at a.b.render (/home/site/wwwroot/node_modules/react-dom/cjs/react-dom-server.node.production.min.js:42:43)\n    at a.b.read (/home/site/wwwroot/node_modules/react-dom/cjs/react-dom-server.node.production.min.js:41:83)\n    at Object.exports.renderToString (/home/site/wwwroot/node_modules/react-dom/cjs/react-dom-server.node.production.min.js:52:138)\n    at Object.renderPage (/home/site/wwwroot/node_modules/next/dist/server/render.js:768:45)\n    at Object.defaultGetInitialProps (/home/site/wwwroot/node_modules/next/dist/server/render.js:375:51)\n    at Function.getInitialProps (/home/site/wwwroot/.temp/.next/server/chunks/859.js:537:20)\nChanged javascript:void to # on node a\nChanged javascript:void to # on node a\nChanged javascript:void to # on node a\nChanged javascript:void to # on node a\nChanged javascript:void to # on node a\nChanged javascript:void to # on node a\nChanged javascript:void to # on node a\nChanged javascript:void to # on node a\nChanged javascript:void to # on node a\nChanged javascript:void to # on node a\nChanged javascript:void to # on node a\nChanged javascript:void to # on node a\nChanged javascript:void to # on node a\nChanged javascript:void to # on node a\nChanged javascript:void to # on node a\nChanged javascript:void to # on node a\nChanged javascript:void to # on node a\nChanged javascript:void to # on node a\nChanged javascript:void to # on node a\nChanged javascript:void to # on node a\nChanged javascript:void to # on node a\nChanged javascript:void to # on node a\nChanged javascript:void to # on node a\n\n> Build error occurred\nError: Export encountered errors on following paths:\n\t/[[...slug]]: /en/insights/t03-topic/t06report2\n    at /home/site/wwwroot/node_modules/next/dist/export/index.js:397:19\n    at runMicrotasks (<anonymous>)\n    at processTicksAndRejections (node:internal/process/task_queues:96:5)\n    at async Span.traceAsyncFn (/home/site/wwwroot/node_modules/next/dist/trace/trace.js:79:20)\n    at async /home/site/wwwroot/node_modules/next/dist/build/index.js:999:17\n    at async Span.traceAsyncFn (/home/site/wwwroot/node_modules/next/dist/trace/trace.js:79:20)\n    at async /home/site/wwwroot/node_modules/next/dist/build/index.js:875:13\n    at async Span.traceAsyncFn (/home/site/wwwroot/node_modules/next/dist/trace/trace.js:79:20)\n    at async Object.build [as default] (/home/site/wwwroot/node_modules/next/dist/build/index.js:55:25)\n\n    at ChildProcess.exithandler (node:child_process:402:12)\n    at ChildProcess.emit (node:events:513:28)\n    at ChildProcess.emit (node:domain:489:12)\n    at maybeClose (node:internal/child_process:1100:16)\n    at Process.ChildProcess._handle.onexit (node:internal/child_process:304:5)"},"time":"2023-06-15T07:48:39.322Z"}
   at Uniform.Services.HostedDeploymentService.(String , String , DateTime& )
   at Uniform.Services.HostedDeploymentService.RunExternalService(IDictionary`2 pages, String timestamp)
   at Uniform.Pipelines.Deployment.RunExternalService..<Process>b__0()
   at Uniform.Helper.Retry[T](Func`1 act, Int32 num, String text, Int32 timeoutMs, Nullable`1 increasedTimeoutMs)
   at Uniform.Pipelines.Deployment.RunExternalService.Process(DeploymentArgs args)
   at (Object , Object )
   at Sitecore.Pipelines.CorePipeline.Run(PipelineArgs args)
   at Sitecore.Pipelines.DefaultCorePipelineManager.Run(String pipelineName, PipelineArgs args, String pipelineDomain, Boolean failIfNotExists)
   at Sitecore.Pipelines.DefaultCorePipelineManager.Run(String pipelineName, PipelineArgs args, String pipelineDomain)
   at Uniform.Services.DeploymentOrchestrationService.Deploy()
   --- End of inner exception stack trace ---
   at Uniform.Services.DeploymentOrchestrationService.Deploy()
   at Uniform.Pipelines.Publish.BasePublishProcessor.DoProcess(String targetDatabaseName, String[] languages)
   at Uniform.Pipelines.Publish.BasePublishProcessor.Process(PublishContext context)
   --- End of inner exception stack trace ---
   at Uniform.Pipelines.Publish.BasePublishProcessor.Process(PublishContext context)
   at (Object , Object )
   at Sitecore.Pipelines.CorePipeline.Run(PipelineArgs args)
   at Sitecore.Pipelines.DefaultCorePipelineManager.Run(String pipelineName, PipelineArgs args, String pipelineDomain, Boolean failIfNotExists)
   at Sitecore.Pipelines.DefaultCorePipelineManager.Run(String pipelineName, PipelineArgs args, String pipelineDomain)
   at Sitecore.Publishing.Pipelines.Publish.PublishPipeline.Run(PublishContext context)
   at Sitecore.Publishing.Publisher.PublishWithResult()
   --- End of inner exception stack trace ---
   at System.RuntimeMethodHandle.InvokeMethod(Object target, Object[] arguments, Signature sig, Boolean constructor)
   at System.Reflection.RuntimeMethodInfo.UnsafeInvokeInternal(Object obj, Object[] parameters, Object[] arguments)
   at System.Reflection.RuntimeMethodInfo.Invoke(Object obj, BindingFlags invokeAttr, Binder binder, Object[] parameters, CultureInfo culture)
   at Sitecore.Reflection.ReflectionUtil.InvokeMethod(MethodInfo method, Object[] parameters, Object obj)
   at Sitecore.Jobs.JobRunner.RunMethod(JobArgs args)
   at (Object , Object )
   at Sitecore.Pipelines.CorePipeline.Run(PipelineArgs args)
   at Sitecore.Pipelines.DefaultCorePipelineManager.Run(String pipelineName, PipelineArgs args, String pipelineDomain, Boolean failIfNotExists)
   at Sitecore.Pipelines.DefaultCorePipelineManager.Run(String pipelineName, PipelineArgs args, String pipelineDomain)
   at Sitecore.Jobs.DefaultJob.DoExecute()
   at Sitecore.Abstractions.BaseJob.ThreadEntry(Object state)